{"text_format":"1","workbook":"xlsx","n_sheets":5,"sheets":["STARTNA","ciljna nesl","CILJNA služb","POBJEDNICI","KATEGORIJE"],"not_rendered":{"charts":0,"images":7,"macros":0,"external_links":0,"defined_names":4,"comments":0,"pivot_tables":0},"unopened":[],"bounds":{"document_bytes":16777216,"sheet_cells":100000,"rows_first":2000,"rows_last":500,"rows_between":2000,"halvings":0,"cell_chars":16384,"cell_head_chars":4096},"cells_cut":0,"cells_raw":0,"read":"whole","date_system":"1900"}

{"sheet":"STARTNA","index":0,"n_rows":154,"n_cols":8,"rows_kept":154,"cut":false,"hidden":false,"merged":[[153,0,158,7],[148,2,148,3],[149,2,149,3],[150,2,150,3],[129,0,129,1],[134,0,134,1],[139,0,139,1],[146,2,146,3],[147,2,147,3],[99,2,99,3],[100,2,100,3],[101,2,101,3],[104,1,104,4],[124,0,124,1],[96,0,96,8],[97,1,97,3],[4,0,4,7]]}
[]
[]
[]
[]
["32. OTVORENO PRVENSTVO DALMACIJE U DALJINSKOM PLIVANJU - OMIŠ 2025."]
[]
[null,"dionica - 1501 metar",null,null,null,"Omiš, 23. 8. 2025."]
[]
[null,"  STARTNA LISTA  "]
[]
["ST. BR","PREZIME I IME","S","GOD","KAT","klub/rekr","MJESTO","DOM"]
[1,"PRVAN BORKO","M",1951,{"$f":"IF(D12>2012,\"M/Ž 12\",IF(D12>2009,\"M/Ž 15\",IF(D12>2005,\"M/Ž 19\",IF(D12>1995,\"M/Ž 29\",IF(D12>1985,\"M/Ž 39\",IF(D12>1975,\"M/Ž 49\",IF(D12>1965,\"M/Ž 59\",IF(D12>1959,\"M/Ž 65\",IF(D12>1954,\"M/Ž 70\",IF(D12>1949,\"M/Ž 75\",IF(D12>1931,\"M/Ž 75+\",)))))))))))","v":"M/Ž 75"},"REKR","ZAGREB",{"$f":"IF($G$12:$G$162=\"Omiš\",\"DOM\",)","v":0}]
[2,"VIDEKOVIĆ UNA","Ž",2011,"M/Ž 15","KLUB ","VINKOVCI",0]
[3,"ŠKORIĆ JOSIP","M",1960,"M/Ž 65","REKR","BIH",0]
[4,"ĆOSIĆ HRVOJE","M",1959,"M/Ž 70","REKR","BIH",0]
[5,"KAČIĆ ZORAN","M",1950,"M/Ž 75","REKR","SPLIT",0]
[6,"KAČIĆ DUPLANČIĆ DIANA","Ž",1978,"M/Ž 49","REKR","SPLIT",0]
[7,"KEKEZ ANTE","M",1950,"M/Ž 75","REKR","OMIŠ","DOM"]
[8,"VERINA MARIA ","Ž",1965,"M/Ž 65","REKR","SUTIVAN",0]
[9,"KNEŽEVIĆ FILIP","M",1995,"M/Ž 39","REKR","ŠIBENIK",0]
{"$rows_left_out":135}
{"sheet":"ciljna nesl","index":1,"n_rows":72,"n_cols":14,"rows_kept":72,"cut":false,"hidden":false,"merged":[[4,0,4,8],[5,13,5,16],[6,13,6,16],[71,0,76,8]]}
[]
[]
[]
[]
["299 OTVORENO PRVENSTVO DALMACIJE U DALJINSKOM PLIVANJU - OMIŠ 2022.",null,null,null,null,null,null,null,null,null,null,null,null,"1. Lozinka  \"h\" je stalno aktivna"]
[null,null,null,null,null,null,null,null,null,null,null,null,null,"2. Upisivati startne brojeve s ramena u stupac B prema postignutom rangu"]
[null,"dionica - 1501 metar",null,null,null,"Omiš, 20. 8. 2022.",null,null,null,null,null,null,null,"   3. U novi red prelaziti s TAB"]
[null,null,null,null,null,null,null,null,null,null,null,null,null,"4. Skinuti zaštitu i u stupac „I” upisati rezultate na način XX,XX  (28,57)"]
[null,null,"neslužbena  CILJNA LISTA  "]
[null,null,null,null,null,null,null,null,null,null,null,null,null,"5. Po upisu zadnjeg rezultata snimiti podatke"]
["rang","ST. BR","PREZIME I IME","S","GOD","KAT","klub/rekr","MJESTO","rez","DOM","IK",null,null,"6. Kopirati podatke od stupca B – K i zalijepiti u CILJNU služb."]
[1,32,{"$f":"VLOOKUP(B12,STARTNA!$A$12:$H$96,2,)","v":"TAFRA MATE"},{"$f":"VLOOKUP(B12,STARTNA!$A$12:$H$96,3,)","v":"M"},{"$f":"VLOOKUP(B12,STARTNA!$A$12:$H$96,4,)","v":2009},{"$f":"VLOOKUP(B12,STARTNA!$A$12:$H$96,5,)","v":"M/Ž 19"},{"$f":"VLOOKUP(B12,STARTNA!$A$12:$H$96,6,)","v":"REKR"},{"$f":"VLOOKUP(B12,STARTNA!$A$12:$H$96,7,)","v":"OMIŠ"},18.11,{"$f":"IF($H$12:$H$98=\"Omiš\",\"DOM\",)","v":"DOM"},{"$f":"AND(E12<2014,G12=\"KLUB\")","v":false},null,null,"7. Zaštititi list"]
[2,25,"BRATIĆ DAMIR","M",2012,{"$f":"IF(E13>2012,\"M/Ž 12\",IF(E13>2009,\"M/Ž 15\",IF(E13>2005,\"M/Ž 19\",IF(E13>1995,\"M/Ž 29\",IF(E13>1985,\"M/Ž 39\",IF(E13>1975,\"M/Ž 49\",IF(E13>1965,\"M/Ž 59\",IF(E13>1959,\"M/Ž 65\",IF(E13>1954,\"M/Ž 70\",IF(E13>1949,\"M/Ž 75\",IF(E13>1931,\"M/Ž 75+\",)))))))))))","v":"M/Ž 15"},"REKR","SPLIT",18.489999999999998,0,1]
[3,34,{"$f":"VLOOKUP(B14,STARTNA!$A$12:$H$96,2,)","v":"LATINOVIĆ SRĐAN"},{"$f":"VLOOKUP(B14,STARTNA!$A$12:$H$96,3,)","v":"M"},{"$f":"VLOOKUP(B14,STARTNA!$A$12:$H$96,4,)","v":1988},{"$f":"VLOOKUP(B14,STARTNA!$A$12:$H$96,5,)","v":"M/Ž 39"},{"$f":"VLOOKUP(B14,STARTNA!$A$12:$H$96,6,)","v":"REKR"},{"$f":"VLOOKUP(B14,STARTNA!$A$12:$H$96,7,)","v":"SPLIT"},19.11,0,false]
[4,29,{"$f":"VLOOKUP(B15,STARTNA!$A$12:$H$96,2,)","v":"STOJANOVIĆ MIHOVIL"},{"$f":"VLOOKUP(B15,STARTNA!$A$12:$H$96,3,)","v":"M"},{"$f":"VLOOKUP(B15,STARTNA!$A$12:$H$96,4,)","v":1985},{"$f":"VLOOKUP(B15,STARTNA!$A$12:$H$96,5,)","v":"M/Ž 49"},{"$f":"VLOOKUP(B15,STARTNA!$A$12:$H$96,6,)","v":"REKR"},{"$f":"VLOOKUP(B15,STARTNA!$A$12:$H$96,7,)","v":"DRNIŠ"},19.16,0,false]
[5,39,{"$f":"VLOOKUP(B16,STARTNA!$A$12:$H$96,2,)","v":"BOBANOVIĆ NIKO"},{"$f":"VLOOKUP(B16,STARTNA!$A$12:$H$96,3,)","v":"M"},{"$f":"VLOOKUP(B16,STARTNA!$A$12:$H$96,4,)","v":2012},{"$f":"VLOOKUP(B16,STARTNA!$A$12:$H$96,5,)","v":"M/Ž 15"},{"$f":"VLOOKUP(B16,STARTNA!$A$12:$H$96,6,)","v":"REKR"},{"$f":"VLOOKUP(B16,STARTNA!$A$12:$H$96,7,)","v":"SPLIT"},20.03,0,false]
[6,31,{"$f":"VLOOKUP(B17,STARTNA!$A$12:$H$96,2,)","v":"GALIĆ PETRA"},{"$f":"VLOOKUP(B17,STARTNA!$A$12:$H$96,3,)","v":"Ž"},{"$f":"VLOOKUP(B17,STARTNA!$A$12:$H$96,4,)","v":2010},{"$f":"VLOOKUP(B17,STARTNA!$A$12:$H$96,5,)","v":"M/Ž 15"},{"$f":"VLOOKUP(B17,STARTNA!$A$12:$H$96,6,)","v":"REKR"},{"$f":"VLOOKUP(B17,STARTNA!$A$12:$H$96,7,)","v":"SPLIT"},20.16,0,false]
[7,23,{"$f":"VLOOKUP(B18,STARTNA!$A$12:$H$96,2,)","v":"KUNDID IGOR"},{"$f":"VLOOKUP(B18,STARTNA!$A$12:$H$96,3,)","v":"M"},{"$f":"VLOOKUP(B18,STARTNA!$A$12:$H$96,4,)","v":1981},{"$f":"VLOOKUP(B18,STARTNA!$A$12:$H$96,5,)","v":"M/Ž 49"},{"$f":"VLOOKUP(B18,STARTNA!$A$12:$H$96,6,)","v":"REKR"},{"$f":"VLOOKUP(B18,STARTNA!$A$12:$H$96,7,)","v":"STOBREČ"},20.34,0,false]
[8,44,{"$f":"VLOOKUP(B19,STARTNA!$A$12:$H$96,2,)","v":"GABELLINI DIEGO"},{"$f":"VLOOKUP(B19,STARTNA!$A$12:$H$96,3,)","v":"M"},{"$f":"VLOOKUP(B19,STARTNA!$A$12:$H$96,4,)","v":2013},{"$f":"VLOOKUP(B19,STARTNA!$A$12:$H$96,5,)","v":"M/Ž 12"},{"$f":"VLOOKUP(B19,STARTNA!$A$12:$H$96,6,)","v":"REKR"},{"$f":"VLOOKUP(B19,STARTNA!$A$12:$H$96,7,)","v":"ITALIJA"},20.45,0,false]
[9,2,{"$f":"VLOOKUP(B20,STARTNA!$A$12:$H$96,2,)","v":"VIDEKOVIĆ UNA"},{"$f":"VLOOKUP(B20,STARTNA!$A$12:$H$96,3,)","v":"Ž"},{"$f":"VLOOKUP(B20,STARTNA!$A$12:$H$96,4,)","v":2011},{"$f":"VLOOKUP(B20,STARTNA!$A$12:$H$96,5,)","v":"M/Ž 15"},{"$f":"VLOOKUP(B20,STARTNA!$A$12:$H$96,6,)","v":"KLUB "},{"$f":"VLOOKUP(B20,STARTNA!$A$12:$H$96,7,)","v":"VINKOVCI"},20.51,0,1]
{"$rows_left_out":53}
{"sheet":"CILJNA služb","index":2,"n_rows":77,"n_cols":13,"rows_kept":77,"cut":false,"hidden":false,"merged":[[4,0,4,8],[4,12,4,14],[76,0,81,8]]}
[]
[]
[]
[]
["32. OTVORENO PRVENSTVO DALMACIJE U DALJINSKOM PLIVANJU - OMIŠ 2025.",null,null,null,null,null,null,null,null,null,null,null,"1. Skinuti zaštitu"]
[null,null,null,null,null,null,null,null,null,null,null,null,"2. Kopirati tablicu iz lista „CILJNA NESLUŽBENA”"]
[null,"dionica - 1501 metar",null,null,null,"Omiš, 23. 8. 2025.",null,null,null,null,null,null,"3. Staviti filter"]
[null,null,null,null,null,null,null,null,null,null,null,null,"4. Odabrati stupac K (IK)"]
[null,null,"službena   CILJNA LISTA  ",null,null,null,null,null,null,null,null,null,"5. Odabrati plivače IK"]
[null,null,null,null,null,null,null,null,null,null,null,null,"6. Kopirati plivače IK u tablicu „PLIVAČI IZVAN KONKURENCIJE”"]
["rang","ST. BR","PREZIME I IME","S","GOD","KAT","klub/rekr","MJESTO","rez","DOM","IK",null,"7. Označiti stupac A (Rang) plivača IK bojom"]
[1,32,{"$f":"VLOOKUP(B12,STARTNA!$A$12:$H$96,2,)","v":"TAFRA MATE"},{"$f":"VLOOKUP(B12,STARTNA!$A$12:$H$96,3,)","v":"M"},{"$f":"VLOOKUP(B12,STARTNA!$A$12:$H$96,4,)","v":2009},{"$f":"VLOOKUP(B12,STARTNA!$A$12:$H$96,5,)","v":"M/Ž 19"},{"$f":"VLOOKUP(B12,STARTNA!$A$12:$H$96,6,)","v":"REKR"},{"$f":"VLOOKUP(B12,STARTNA!$A$12:$H$96,7,)","v":"OMIŠ"},18.11,{"$f":"IF($H$12:$H$103=\"Omiš\",\"DOM\",)","v":"DOM"},{"$f":"AND(E12<2014,G12=\"KLUB\")","v":false},null,"8. Ukinuti filter"]
[2,34,{"$f":"VLOOKUP(B13,STARTNA!$A$12:$H$96,2,)","v":"LATINOVIĆ SRĐAN"},{"$f":"VLOOKUP(B13,STARTNA!$A$12:$H$96,3,)","v":"M"},{"$f":"VLOOKUP(B13,STARTNA!$A$12:$H$96,4,)","v":1988},{"$f":"VLOOKUP(B13,STARTNA!$A$12:$H$96,5,)","v":"M/Ž 39"},{"$f":"VLOOKUP(B13,STARTNA!$A$12:$H$96,6,)","v":"REKR"},{"$f":"VLOOKUP(B13,STARTNA!$A$12:$H$96,7,)","v":"SPLIT"},19.11,0,false,null,"10. Numerirati novi Rang"]
[3,29,{"$f":"VLOOKUP(B14,STARTNA!$A$12:$H$96,2,)","v":"STOJANOVIĆ MIHOVIL"},{"$f":"VLOOKUP(B14,STARTNA!$A$12:$H$96,3,)","v":"M"},{"$f":"VLOOKUP(B14,STARTNA!$A$12:$H$96,4,)","v":1985},{"$f":"VLOOKUP(B14,STARTNA!$A$12:$H$96,5,)","v":"M/Ž 49"},{"$f":"VLOOKUP(B14,STARTNA!$A$12:$H$96,6,)","v":"REKR"},{"$f":"VLOOKUP(B14,STARTNA!$A$12:$H$96,7,)","v":"DRNIŠ"},19.16,0,false,null,"11. Staviti zaštitu „h”"]
[4,39,{"$f":"VLOOKUP(B15,STARTNA!$A$12:$H$96,2,)","v":"BOBANOVIĆ NIKO"},{"$f":"VLOOKUP(B15,STARTNA!$A$12:$H$96,3,)","v":"M"},{"$f":"VLOOKUP(B15,STARTNA!$A$12:$H$96,4,)","v":2012},{"$f":"VLOOKUP(B15,STARTNA!$A$12:$H$96,5,)","v":"M/Ž 15"},{"$f":"VLOOKUP(B15,STARTNA!$A$12:$H$96,6,)","v":"REKR"},{"$f":"VLOOKUP(B15,STARTNA!$A$12:$H$96,7,)","v":"SPLIT"},20.03,0,false]
[5,31,{"$f":"VLOOKUP(B16,STARTNA!$A$12:$H$96,2,)","v":"GALIĆ PETRA"},"Ž",{"$f":"VLOOKUP(B16,STARTNA!$A$12:$H$96,4,)","v":2010},{"$f":"VLOOKUP(B16,STARTNA!$A$12:$H$96,5,)","v":"M/Ž 15"},{"$f":"VLOOKUP(B16,STARTNA!$A$12:$H$96,6,)","v":"REKR"},{"$f":"VLOOKUP(B16,STARTNA!$A$12:$H$96,7,)","v":"SPLIT"},20.16,0,false]
[6,23,{"$f":"VLOOKUP(B17,STARTNA!$A$12:$H$96,2,)","v":"KUNDID IGOR"},{"$f":"VLOOKUP(B17,STARTNA!$A$12:$H$96,3,)","v":"M"},{"$f":"VLOOKUP(B17,STARTNA!$A$12:$H$96,4,)","v":1981},{"$f":"VLOOKUP(B17,STARTNA!$A$12:$H$96,5,)","v":"M/Ž 49"},{"$f":"VLOOKUP(B17,STARTNA!$A$12:$H$96,6,)","v":"REKR"},{"$f":"VLOOKUP(B17,STARTNA!$A$12:$H$96,7,)","v":"STOBREČ"},20.34,0,false]
[7,44,{"$f":"VLOOKUP(B18,STARTNA!$A$12:$H$96,2,)","v":"GABELLINI DIEGO"},{"$f":"VLOOKUP(B18,STARTNA!$A$12:$H$96,3,)","v":"M"},{"$f":"VLOOKUP(B18,STARTNA!$A$12:$H$96,4,)","v":2013},{"$f":"VLOOKUP(B18,STARTNA!$A$12:$H$96,5,)","v":"M/Ž 12"},{"$f":"VLOOKUP(B18,STARTNA!$A$12:$H$96,6,)","v":"REKR"},{"$f":"VLOOKUP(B18,STARTNA!$A$12:$H$96,7,)","v":"ITALIJA"},20.45,0,false]
[8,28,{"$f":"VLOOKUP(B19,STARTNA!$A$12:$H$96,2,)","v":"ZEKANOVIĆ MIA"},{"$f":"VLOOKUP(B19,STARTNA!$A$12:$H$96,3,)","v":"Ž"},{"$f":"VLOOKUP(B19,STARTNA!$A$12:$H$96,4,)","v":2010},{"$f":"VLOOKUP(B19,STARTNA!$A$12:$H$96,5,)","v":"M/Ž 15"},{"$f":"VLOOKUP(B19,STARTNA!$A$12:$H$96,6,)","v":"REKR"},{"$f":"VLOOKUP(B19,STARTNA!$A$12:$H$96,7,)","v":"ZADAR"},20.58,0,false]
[9,33,{"$f":"VLOOKUP(B20,STARTNA!$A$12:$H$96,2,)","v":"BOŽAN LUKA"},{"$f":"VLOOKUP(B20,STARTNA!$A$12:$H$96,3,)","v":"M"},{"$f":"VLOOKUP(B20,STARTNA!$A$12:$H$96,4,)","v":2010},{"$f":"VLOOKUP(B20,STARTNA!$A$12:$H$96,5,)","v":"M/Ž 15"},{"$f":"VLOOKUP(B20,STARTNA!$A$12:$H$96,6,)","v":"REKR"},{"$f":"VLOOKUP(B20,STARTNA!$A$12:$H$96,7,)","v":"ZAGREB"},21,0,false]
{"$rows_left_out":58}
{"sheet":"POBJEDNICI","index":3,"n_rows":52,"n_cols":11,"rows_kept":52,"cut":false,"hidden":false,"merged":[[4,0,4,9],[4,13,4,16],[7,13,7,16],[51,0,56,8]]}
[]
[]
[]
[]
["299 OTVORENO PRVENSTVO DALMACIJE U DALJINSKOM PLIVANJU - OMIŠ 2022."]
[]
[null,"dionica - 1501 metar",null,null,null,"Omiš, 20. 8. 2022."]
[]
[null,null,"POBJEDNICI"]
[]
[null,null,"UKUPNO MUŠKI"]
["rang","ST. BR","PREZIME I IME","S","GOD","KAT","klub/rekr","MJESTO","rez","DOM","IK"]
[1,32,{"$f":"VLOOKUP(B13,STARTNA!$A$12:$H$96,2,)","v":"TAFRA MATE"},{"$f":"VLOOKUP(B13,STARTNA!$A$12:$H$96,3,)","v":"M"},{"$f":"VLOOKUP(B13,STARTNA!$A$12:$H$96,4,)","v":2009},{"$f":"VLOOKUP(B13,STARTNA!$A$12:$H$96,5,)","v":"M/Ž 19"},{"$f":"VLOOKUP(B13,STARTNA!$A$12:$H$96,6,)","v":"REKR"},{"$f":"VLOOKUP(B13,STARTNA!$A$12:$H$96,7,)","v":"OMIŠ"},18.11,{"$f":"IF($H$12:$H$161=\"Omiš\",\"DOM\",)","v":"DOM"},0]
[2,34,{"$f":"VLOOKUP(B14,STARTNA!$A$12:$H$96,2,)","v":"LATINOVIĆ SRĐAN"},{"$f":"VLOOKUP(B14,STARTNA!$A$12:$H$96,3,)","v":"M"},{"$f":"VLOOKUP(B14,STARTNA!$A$12:$H$96,4,)","v":1988},{"$f":"VLOOKUP(B14,STARTNA!$A$12:$H$96,5,)","v":"M/Ž 39"},{"$f":"VLOOKUP(B14,STARTNA!$A$12:$H$96,6,)","v":"REKR"},{"$f":"VLOOKUP(B14,STARTNA!$A$12:$H$96,7,)","v":"SPLIT"},19.11,{"$f":"IF($H$12:$H$161=\"Omiš\",\"DOM\",)","v":0},{"$f":"AND(E14<2014,G14=\"KLUB\")","v":false}]
[3,29,{"$f":"VLOOKUP(B15,STARTNA!$A$12:$H$96,2,)","v":"STOJANOVIĆ MIHOVIL"},{"$f":"VLOOKUP(B15,STARTNA!$A$12:$H$96,3,)","v":"M"},{"$f":"VLOOKUP(B15,STARTNA!$A$12:$H$96,4,)","v":1985},{"$f":"VLOOKUP(B15,STARTNA!$A$12:$H$96,5,)","v":"M/Ž 49"},{"$f":"VLOOKUP(B15,STARTNA!$A$12:$H$96,6,)","v":"REKR"},{"$f":"VLOOKUP(B15,STARTNA!$A$12:$H$96,7,)","v":"DRNIŠ"},19.16,{"$f":"IF($H$12:$H$104=\"Omiš\",\"DOM\",)","v":0},{"$f":"AND(E15<2014,G15=\"KLUB\")","v":false}]
[]
[null,null,"UKUPNO ŽENSKE"]
["rang","ST. BR","PREZIME I IME","S","GOD","KAT","klub/rekr","MJESTO","rez","DOM","IK"]
[1,31,{"$f":"VLOOKUP(B19,STARTNA!$A$12:$H$96,2,)","v":"GALIĆ PETRA"},"Ž",{"$f":"VLOOKUP(B19,STARTNA!$A$12:$H$96,4,)","v":2010},{"$f":"VLOOKUP(B19,STARTNA!$A$12:$H$96,5,)","v":"M/Ž 15"},{"$f":"VLOOKUP(B19,STARTNA!$A$12:$H$96,6,)","v":"REKR"},{"$f":"VLOOKUP(B19,STARTNA!$A$12:$H$96,7,)","v":"SPLIT"},20.16,{"$f":"IF($H$12:$H$161=\"Omiš\",\"DOM\",)","v":0},{"$f":"AND(E19<2014,G19=\"KLUB\")","v":false}]
[2,28,{"$f":"VLOOKUP(B20,STARTNA!$A$12:$H$96,2,)","v":"ZEKANOVIĆ MIA"},{"$f":"VLOOKUP(B20,STARTNA!$A$12:$H$96,3,)","v":"Ž"},{"$f":"VLOOKUP(B20,STARTNA!$A$12:$H$96,4,)","v":2010},{"$f":"VLOOKUP(B20,STARTNA!$A$12:$H$96,5,)","v":"M/Ž 15"},{"$f":"VLOOKUP(B20,STARTNA!$A$12:$H$96,6,)","v":"REKR"},{"$f":"VLOOKUP(B20,STARTNA!$A$12:$H$96,7,)","v":"ZADAR"},20.58,{"$f":"IF($H$12:$H$161=\"Omiš\",\"DOM\",)","v":0},{"$f":"AND(E20<2014,G20=\"KLUB\")","v":false}]
{"$rows_left_out":33}
{"sheet":"KATEGORIJE","index":4,"n_rows":124,"n_cols":11,"rows_kept":124,"cut":false,"hidden":false,"merged":[[4,0,4,9],[4,13,4,16],[7,13,7,16],[123,0,128,8]]}
[]
[]
[]
[]
["299 OTVORENO PRVENSTVO DALMACIJE U DALJINSKOM PLIVANJU - OMIŠ 2022."]
[]
[null,"dionica - 1501 metar",null,null,null,"Omiš, 20. 8. 2022."]
[]
[null,null,"KATEGORIJE"]
[]
[]
[null,null,"M12"]
["rang","ST. BR","PREZIME I IME","S","GOD","KAT","klub/rekr","MJESTO","rez","DOM","IK"]
[1,44,{"$f":"VLOOKUP(B14,STARTNA!$A$12:$H$96,2,)","v":"GABELLINI DIEGO"},{"$f":"VLOOKUP(B14,STARTNA!$A$12:$H$96,3,)","v":"M"},{"$f":"VLOOKUP(B14,STARTNA!$A$12:$H$96,4,)","v":2013},{"$f":"VLOOKUP(B14,STARTNA!$A$12:$H$96,5,)","v":"M/Ž 12"},{"$f":"VLOOKUP(B14,STARTNA!$A$12:$H$96,6,)","v":"REKR"},{"$f":"VLOOKUP(B14,STARTNA!$A$12:$H$96,7,)","v":"ITALIJA"},20.45,{"$f":"IF($H$12:$H$138=\"Omiš\",\"DOM\",)","v":0},{"$f":"AND(E14<2014,G14=\"KLUB\")","v":false}]
[2,11,{"$f":"VLOOKUP(B15,STARTNA!$A$12:$H$96,2,)","v":"BRKOVIĆ MARIN"},{"$f":"VLOOKUP(B15,STARTNA!$A$12:$H$96,3,)","v":"M"},{"$f":"VLOOKUP(B15,STARTNA!$A$12:$H$96,4,)","v":2015},{"$f":"VLOOKUP(B15,STARTNA!$A$12:$H$96,5,)","v":"M/Ž 12"},{"$f":"VLOOKUP(B15,STARTNA!$A$12:$H$96,6,)","v":"KLUB "},{"$f":"VLOOKUP(B15,STARTNA!$A$12:$H$96,7,)","v":"SPLIT"},25.09,{"$f":"IF($H$12:$H$138=\"Omiš\",\"DOM\",)","v":0},{"$f":"AND(E15<2014,G15=\"KLUB\")","v":false}]
[3,38,{"$f":"VLOOKUP(B16,STARTNA!$A$12:$H$96,2,)","v":"BOBANOVIĆ PETAR"},{"$f":"VLOOKUP(B16,STARTNA!$A$12:$H$96,3,)","v":"M"},{"$f":"VLOOKUP(B16,STARTNA!$A$12:$H$96,4,)","v":2015},{"$f":"VLOOKUP(B16,STARTNA!$A$12:$H$96,5,)","v":"M/Ž 12"},{"$f":"VLOOKUP(B16,STARTNA!$A$12:$H$96,6,)","v":"REKR"},{"$f":"VLOOKUP(B16,STARTNA!$A$12:$H$96,7,)","v":"SPLIT"},26.09,{"$f":"IF($H$12:$H$138=\"Omiš\",\"DOM\",)","v":0},{"$f":"AND(E16<2014,G16=\"KLUB\")","v":false}]
[]
[null,null,"Ž12"]
["rang","ST. BR","PREZIME I IME","S","GOD","KAT","klub/rekr","MJESTO","rez","DOM","IK"]
[1]
{"$rows_left_out":104}