{"text_format":"1","workbook":"xlsx","n_sheets":5,"sheets":["STARTNA","ciljna nesl","CILJNA služb","POBJEDNICI","KATEGORIJE"],"not_rendered":{"charts":0,"images":7,"macros":0,"external_links":0,"defined_names":4,"comments":0,"pivot_tables":0},"unopened":[],"bounds":{"document_bytes":16777216,"sheet_cells":100000,"rows_first":2000,"rows_last":500,"rows_between":2000,"halvings":0,"cell_chars":16384,"cell_head_chars":4096},"cells_cut":0,"cells_raw":0,"read":"whole","date_system":"1900"}

{"sheet":"STARTNA","index":0,"n_rows":154,"n_cols":8,"rows_kept":154,"cut":false,"hidden":false,"merged":[[153,0,158,7],[148,2,148,3],[149,2,149,3],[150,2,150,3],[129,0,129,1],[134,0,134,1],[139,0,139,1],[146,2,146,3],[147,2,147,3],[99,2,99,3],[100,2,100,3],[101,2,101,3],[104,1,104,4],[124,0,124,1],[96,0,96,8],[97,1,97,3],[4,0,4,7]]}
[]
[]
[]
[]
["32. OTVORENO PRVENSTVO DALMACIJE U DALJINSKOM PLIVANJU - OMIŠ 2025."]
[]
[null,"dionica - 1501 metar",null,null,null,"Omiš, 23. 8. 2025."]
[]
[null,"  STARTNA LISTA  "]
[]
["ST. BR","PREZIME I IME","S","GOD","KAT","klub/rekr","MJESTO","DOM"]
[1,"PRVAN BORKO","M",1951,{"$f":"IF(D12>2012,\"M/Ž 12\",IF(D12>2009,\"M/Ž 15\",IF(D12>2005,\"M/Ž 19\",IF(D12>1995,\"M/Ž 29\",IF(D12>1985,\"M/Ž 39\",IF(D12>1975,\"M/Ž 49\",IF(D12>1965,\"M/Ž 59\",IF(D12>1959,\"M/Ž 65\",IF(D12>1954,\"M/Ž 70\",IF(D12>1949,\"M/Ž 75\",IF(D12>1931,\"M/Ž 75+\",)))))))))))","v":"M/Ž 75"},"REKR","ZAGREB",{"$f":"IF($G$12:$G$162=\"Omiš\",\"DOM\",)","v":0}]
[2,"VIDEKOVIĆ UNA","Ž",2011,"M/Ž 15","KLUB ","VINKOVCI",0]
[3,"ŠKORIĆ JOSIP","M",1960,"M/Ž 65","REKR","BIH",0]
[4,"ĆOSIĆ HRVOJE","M",1959,"M/Ž 70","REKR","BIH",0]
[5,"KAČIĆ ZORAN","M",1950,"M/Ž 75","REKR","SPLIT",0]
[6,"KAČIĆ DUPLANČIĆ DIANA","Ž",1978,"M/Ž 49","REKR","SPLIT",0]
[7,"KEKEZ ANTE","M",1950,"M/Ž 75","REKR","OMIŠ","DOM"]
[8,"VERINA MARIA ","Ž",1965,"M/Ž 65","REKR","SUTIVAN",0]
[9,"KNEŽEVIĆ FILIP","M",1995,"M/Ž 39","REKR","ŠIBENIK",0]
[10,"RADNIĆ GEA","Ž",2013,"M/Ž 12","KLUB ","SPLIT",0]
[11,"BRKOVIĆ MARIN","M",2015,"M/Ž 12","KLUB ","SPLIT",0]
[12,"DUMANIĆ NAĐAN","M",1962,"M/Ž 65","REKR","SPLIT",0]
[13,"ŠUŠNJAR MARIN","M",1961,"M/Ž 65","REKR","SPLIT",0]
[14,"ŠUŠNJAR PJERA","Ž",1967,"M/Ž 59","REKR","SPLIT",0]
[15,"LIPNJAK TAMARA","Ž",1992,"M/Ž 39","REKR","ZAGREB",0]
[16,"BILANOVIĆ JURE","M",1981,"M/Ž 49","REKR","DUGI RAT",0]
[17,"BELOUSOVA MARIA","Ž",2012,"M/Ž 15","KLUB ","BRASINA",0]
[18,"TOMIĆ ZORAN","M",1974,"M/Ž 59","REKR","SPLIT",0]
[19,"GRGAT MARIJO","M",1974,"M/Ž 59","REKR","DUGI RAT",0]
[20,"LUKIĆ ZITA","Ž",2002,"M/Ž 29","REKR","SPLIT",0]
[21,"ARAPOVIĆ ANA","Ž",1982,"M/Ž 49","REKR","SPLIT",0]
[22,"BALIĆ ANTE","M",1981,"M/Ž 49","REKR","ZAGREB",0]
[23,"KUNDID IGOR","M",1981,"M/Ž 49","REKR","STOBREČ",0]
[24,"KUNDID TONI","M",2014,"M/Ž 12","REKR ","STOBREČ",0]
[25,"BRATIĆ DAMIR","M",2012,"M/Ž 15","KLUB ","SPLIT",0]
[26,"GRUBIŠIĆ INES","Ž",1995,"M/Ž 39","REKR","ZAGREB",0]
[27,"GRUBIŠIĆ DRAGAN","M",1968,"M/Ž 59","REKR","ŠIBENIK",0]
[28,"ZEKANOVIĆ MIA","Ž",2010,"M/Ž 15","REKR","ZADAR",0]
[29,"STOJANOVIĆ MIHOVIL","M",1985,"M/Ž 49","REKR","DRNIŠ",0]
[30,"BRZOVIĆ ANA","Ž",2008,"M/Ž 19","REKR","OMIŠ","DOM"]
[31,"GALIĆ PETRA","Ž",2010,"M/Ž 15","REKR","SPLIT",0]
[32,"TAFRA MATE","M",2009,"M/Ž 19","REKR","OMIŠ","DOM"]
[33,"BOŽAN LUKA","M",2010,{"$f":"IF(D44>2012,\"M/Ž 12\",IF(D44>2009,\"M/Ž 15\",IF(D44>2005,\"M/Ž 19\",IF(D44>1995,\"M/Ž 29\",IF(D44>1985,\"M/Ž 39\",IF(D44>1975,\"M/Ž 49\",IF(D44>1965,\"M/Ž 59\",IF(D44>1959,\"M/Ž 65\",IF(D44>1954,\"M/Ž 70\",IF(D44>1949,\"M/Ž 75\",IF(D44>1931,\"M/Ž 75+\",)))))))))))","v":"M/Ž 15"},"REKR","ZAGREB",{"$f":"IF($G$12:$G$162=\"Omiš\",\"DOM\",)","v":0}]
[34,"LATINOVIĆ SRĐAN","M",1988,"M/Ž 39","REKR","SPLIT",0]
[35,"ŠOŠIĆ MARKO","M",1985,"M/Ž 49","REKR","BRELA",0]
[36,"JAKOVČIĆ FABJANA","Ž",1975,"M/Ž 59","REKR","OMIŠ","DOM"]
[37,"JAKOVČIĆ ROZA","Ž",2012,"M/Ž 15","REKR","OMIŠ","DOM"]
[38,"BOBANOVIĆ PETAR","M",2015,"M/Ž 12","REKR","SPLIT",0]
[39,"BOBANOVIĆ NIKO","M",2012,"M/Ž 15","REKR","SPLIT",0]
[40,"BOBANOVIĆ HRVOJE","M",1979,"M/Ž 49","REKR","SPLIT",0]
[41,"PERICA ŠINKA","Ž",1966,"M/Ž 59","REKR","OMIŠ","DOM"]
[42,"BOBAN HRVOJE","M",1976,"M/Ž 49","REKR","SPLIT",0]
[43,"BAŠIĆ VEDRAN","M",1975,"M/Ž 59","REKR","SPLIT",0]
[44,"GABELLINI DIEGO","M",2013,"M/Ž 12","REKR","ITALIJA",0]
[45,"MANDUŠIĆ IGOR","M",1974,"M/Ž 59","REKR","TROGIR",0]
[46,"MEKINIĆ PETAR","M",2006,"M/Ž 19","REKR","OMIŠ","DOM"]
[47,"ČAGALJ VICKO","M",1993,"M/Ž 39","REKR","ZAGREB",0]
[48,"TOMAŠ RADOSLAV","M",1951,"M/Ž 75","REKR","ZAGREB",0]
[49,"PULIĆ JOŠKO","M",1981,"M/Ž 49","REKR","DUBROVNIK",0]
[50,"PERAK MARIJA","Ž",2012,"M/Ž 15","REKR","OMIŠ","DOM"]
[51,"DRAGOŠEVIĆ ELA","Ž",2012,"M/Ž 15","REKR","OMIŠ","DOM"]
[52,"STANIĆ CVITA","Ž",2011,"M/Ž 15","REKR","OMIŠ","DOM"]
[53,"STANIĆ LEA","Ž",2012,"M/Ž 15","REKR","OMIŠ","DOM"]
[54,"BEBIĆ MIJO","M",1978,"M/Ž 49","REKR","SPLIT",0]
[55,"PIVČEVIĆ IVO","M",1993,"M/Ž 39","REKR","OMIŠ","DOM"]
[56,"MIMICA MIROSLAV","M",1958,"M/Ž 70","REKR","DUGI RAT",0]
[57,"ŠILJEG FILIPA","Ž",2002,"M/Ž 29","REKR","SPLIT",0]
[]
[]
[]
[]
[]
[]
[]
[]
[]
[]
[]
[]
[]
[]
[]
[null,"plivači IZVAN KONKURENCIJE"]
[]
[null,null,null,null,"KAT","MJESTO","REK / KL"]
[2,"VIDEKOVIĆ UNA","Ž",2011,{"$f":"IF(D87>2012,\"M/Ž 12\",IF(D87>2009,\"M/Ž 15\",IF(D87>2005,\"M/Ž 19\",IF(D87>1995,\"M/Ž 29\",IF(D87>1985,\"M/Ž 39\",IF(D87>1975,\"M/Ž 49\",IF(D87>1965,\"M/Ž 59\",IF(D87>1959,\"M/Ž 65\",IF(D87>1954,\"M/Ž 70\",IF(D87>1949,\"M/Ž 75\",IF(D87>1931,\"M/Ž 75+\",)))))))))))","v":"M/Ž 15"},"KLUB ","VINKOVCI",{"$f":"IF($G$12:$G$162=\"Omiš\",\"DOM\",)","v":0}]
[10,"RADNIĆ GEA","Ž",2013,{"$f":"IF(D88>2012,\"M/Ž 12\",IF(D88>2009,\"M/Ž 15\",IF(D88>2005,\"M/Ž 19\",IF(D88>1995,\"M/Ž 29\",IF(D88>1985,\"M/Ž 39\",IF(D88>1975,\"M/Ž 49\",IF(D88>1965,\"M/Ž 59\",IF(D88>1959,\"M/Ž 65\",IF(D88>1954,\"M/Ž 70\",IF(D88>1949,\"M/Ž 75\",IF(D88>1931,\"M/Ž 75+\",)))))))))))","v":"M/Ž 12"},"KLUB ","SPLIT",{"$f":"IF($G$12:$G$162=\"Omiš\",\"DOM\",)","v":0}]
[17,"BELOUSOVA MARIA","Ž",2012,{"$f":"IF(D89>2012,\"M/Ž 12\",IF(D89>2009,\"M/Ž 15\",IF(D89>2005,\"M/Ž 19\",IF(D89>1995,\"M/Ž 29\",IF(D89>1985,\"M/Ž 39\",IF(D89>1975,\"M/Ž 49\",IF(D89>1965,\"M/Ž 59\",IF(D89>1959,\"M/Ž 65\",IF(D89>1954,\"M/Ž 70\",IF(D89>1949,\"M/Ž 75\",IF(D89>1931,\"M/Ž 75+\",)))))))))))","v":"M/Ž 15"},"KLUB ","BRASINA",{"$f":"IF($G$12:$G$162=\"Omiš\",\"DOM\",)","v":0}]
[25,"BRATIĆ DAMIR","M",2012,{"$f":"IF(D90>2012,\"M/Ž 12\",IF(D90>2009,\"M/Ž 15\",IF(D90>2005,\"M/Ž 19\",IF(D90>1995,\"M/Ž 29\",IF(D90>1985,\"M/Ž 39\",IF(D90>1975,\"M/Ž 49\",IF(D90>1965,\"M/Ž 59\",IF(D90>1959,\"M/Ž 65\",IF(D90>1954,\"M/Ž 70\",IF(D90>1949,\"M/Ž 75\",IF(D90>1931,\"M/Ž 75+\",)))))))))))","v":"M/Ž 15"},"KLUB ","SPLIT",{"$f":"IF($G$12:$G$162=\"Omiš\",\"DOM\",)","v":0}]
[]
[]
[]
[]
[]
[null,"PODACI O PLIVAČIMA "]
[]
[null,"1501 metar",null,null,null,null,null,"Omiš, 23. 8. 2025."]
[]
[null,"UKUPNO PLIVAČA:",{"$f":"COUNTA(B12:B77)","v":57}]
[null,"UKUPNO MUŠKI:",{"$f":"COUNTIF(C12:C77,\"M\")","v":36}]
[null,"UKUPNO ŽENSKE:",{"$f":"COUNTIF(C12:C77,\"Ž\")","v":21}]
[]
[]
[null,"                              DOMAĆI PLIVAČI:",null,null,null,"UK","M","Ž"]
[null,null,null,null,null,{"$f":"COUNTIF(H12:H77,\"DOM\")","v":12},{"$f":"SUMPRODUCT(--($C$12:$C$77=\"M\"),--($H$12:$H$77=\"DOM\"))","v":4},{"$f":"SUMPRODUCT(--($C$12:$C$77=\"Ž\"),--($H$12:$H$77=\"DOM\"))","v":8}]
[]
[null,"KATEGORIJE:"]
[null,null,"UK","M","Ž"]
[null,"M/Ž 12      :",{"$f":"COUNTIF($E$12:$E$77,\"M/Ž 12\")","v":5},{"$f":"SUMPRODUCT(--($E$12:$E$77=\"M/Ž 12\"),--($C$12:$C$77=\"M\"))","v":4},{"$f":"SUMPRODUCT(--($E$12:$E$77=\"M/Ž 12\"),--($C$12:$C$77=\"Ž\"))","v":1}]
[null,"M/Ž 15       :",{"$f":"COUNTIF($E$12:$E$77,\"M/Ž 15\")","v":12},{"$f":"SUMPRODUCT(--($E$12:$E$77=\"M/Ž 15\"),--($C$12:$C$77=\"M\"))","v":3},{"$f":"SUMPRODUCT(--($E$12:$E$77=\"M/Ž 15\"),--($C$12:$C$77=\"Ž\"))","v":9}]
[null,"M/Ž 19       :",{"$f":"COUNTIF($E$12:$E$77,\"M/Ž 19\")","v":3},{"$f":"SUMPRODUCT(--($E$12:$E$77=\"M/Ž 19\"),--($C$12:$C$77=\"M\"))","v":2},{"$f":"SUMPRODUCT(--($E$12:$E$77=\"M/Ž 19\"),--($C$12:$C$77=\"Ž\"))","v":1}]
[null,"M/Ž 20-29  :",{"$f":"COUNTIF($E$12:$E$77,\"M/Ž 29\")","v":2},{"$f":"SUMPRODUCT(--($E$12:$E$77=\"M/Ž 29\"),--($C$12:$C$77=\"M\"))","v":0},{"$f":"SUMPRODUCT(--($E$12:$E$77=\"M/Ž 29\"),--($C$12:$C$77=\"Ž\"))","v":2}]
[null,"M/Ž 30-39  :",{"$f":"COUNTIF($E$12:$E$77,\"M/Ž 39\")","v":6},{"$f":"SUMPRODUCT(--($E$12:$E$77=\"M/Ž 39\"),--($C$12:$C$77=\"M\"))","v":4},{"$f":"SUMPRODUCT(--($E$12:$E$77=\"M/Ž 39\"),--($C$12:$C$77=\"Ž\"))","v":2}]
[null,"M/Ž 40-49  :",{"$f":"COUNTIF($E$12:$E$77,\"M/Ž 49\")","v":11},{"$f":"SUMPRODUCT(--($E$12:$E$77=\"M/Ž 49\"),--($C$12:$C$77=\"M\"))","v":9},{"$f":"SUMPRODUCT(--($E$12:$E$77=\"M/Ž 49\"),--($C$12:$C$77=\"Ž\"))","v":2}]
[null,"M/Ž 50-59  :",{"$f":"COUNTIF($E$12:$E$77,\"M/Ž 59\")","v":8},{"$f":"SUMPRODUCT(--($E$12:$E$77=\"M/Ž 59\"),--($C$12:$C$77=\"M\"))","v":5},{"$f":"SUMPRODUCT(--($E$12:$E$77=\"M/Ž 59\"),--($C$12:$C$77=\"Ž\"))","v":3}]
[null,"M/Ž 60-65    :",{"$f":"COUNTIF($E$12:$E$77,\"M/Ž 65\")","v":4},{"$f":"SUMPRODUCT(--($E$12:$E$77=\"M/Ž 65\"),--($C$12:$C$77=\"M\"))","v":3},{"$f":"SUMPRODUCT(--($E$12:$E$77=\"M/Ž 65\"),--($C$12:$C$77=\"Ž\"))","v":1}]
[null,"M/Ž 66-70    :",{"$f":"COUNTIF($E$12:$E$77,\"M/Ž 70\")","v":2},{"$f":"SUMPRODUCT(--($E$12:$E$77=\"M/Ž 70\"),--($C$12:$C$77=\"M\"))","v":2},{"$f":"SUMPRODUCT(--($E$12:$E$77=\"M/Ž 70\"),--($C$12:$C$77=\"Ž\"))","v":0}]
[null,"M/Ž 70-75    :",{"$f":"COUNTIF($E$12:$E$77,\"M/Ž 75\")","v":4},{"$f":"SUMPRODUCT(--($E$12:$E$77=\"M/Ž 75\"),--($C$12:$C$77=\"M\"))","v":4},{"$f":"SUMPRODUCT(--($E$12:$E$77=\"M/Ž 75\"),--($C$12:$C$77=\"Ž\"))","v":0}]
[null,"M/Ž 75+   :",{"$f":"COUNTIF($E$12:$E$77,\"M/Ž 75+\")","v":0},{"$f":"SUMPRODUCT(--($E$12:$E$77=\"M/Ž 75+\"),--($C$12:$C$77=\"M\"))","v":0},{"$f":"SUMPRODUCT(--($E$12:$E$77=\"M/Ž 75+\"),--($C$12:$C$77=\"Ž\"))","v":0}]
[]
[]
[null,"    PLIVAČI IZVAN KONKURENCIJE:",null,null,null,4]
[]
["NAJSTARIJI PLIVAČ :"]
[]
[5,"KAČIĆ ZORAN","M",1950,{"$f":"IF(D127>2012,\"M/Ž 12\",IF(D127>2009,\"M/Ž 15\",IF(D127>2005,\"M/Ž 19\",IF(D127>1995,\"M/Ž 29\",IF(D127>1985,\"M/Ž 39\",IF(D127>1975,\"M/Ž 49\",IF(D127>1965,\"M/Ž 59\",IF(D127>1959,\"M/Ž 65\",IF(D127>1954,\"M/Ž 70\",IF(D127>1949,\"M/Ž 75\",IF(D127>1931,\"M/Ž 75+\",)))))))))))","v":"M/Ž 75"},"REKR","SPLIT"]
[]
[]
["NAJSTARIJA PLIVAČICA :"]
[]
[8,"VERINA MARIA ","Ž",1965,{"$f":"IF(D132>2012,\"M/Ž 12\",IF(D132>2009,\"M/Ž 15\",IF(D132>2005,\"M/Ž 19\",IF(D132>1995,\"M/Ž 29\",IF(D132>1985,\"M/Ž 39\",IF(D132>1975,\"M/Ž 49\",IF(D132>1965,\"M/Ž 59\",IF(D132>1959,\"M/Ž 65\",IF(D132>1954,\"M/Ž 70\",IF(D132>1949,\"M/Ž 75\",IF(D132>1931,\"M/Ž 75+\",)))))))))))","v":"M/Ž 65"},"REKR","SUTIVAN"]
[]
[]
["NAJMLAĐI PLIVAČ :"]
[]
[11,"BRKOVIĆ MARIN","M",2015,{"$f":"IF(D137>2012,\"M/Ž 12\",IF(D137>2009,\"M/Ž 15\",IF(D137>2005,\"M/Ž 19\",IF(D137>1995,\"M/Ž 29\",IF(D137>1985,\"M/Ž 39\",IF(D137>1975,\"M/Ž 49\",IF(D137>1965,\"M/Ž 59\",IF(D137>1959,\"M/Ž 65\",IF(D137>1954,\"M/Ž 70\",IF(D137>1949,\"M/Ž 75\",IF(D137>1931,\"M/Ž 75+\",)))))))))))","v":"M/Ž 12"},"KLUB ","SPLIT"]
[]
[]
["NAJMLAĐA PLIVAČICA :"]
[]
[10,"RADNIĆ GEA","Ž",2013,{"$f":"IF(D142>2012,\"M/Ž 12\",IF(D142>2009,\"M/Ž 15\",IF(D142>2005,\"M/Ž 19\",IF(D142>1995,\"M/Ž 29\",IF(D142>1985,\"M/Ž 39\",IF(D142>1975,\"M/Ž 49\",IF(D142>1965,\"M/Ž 59\",IF(D142>1959,\"M/Ž 65\",IF(D142>1954,\"M/Ž 70\",IF(D142>1949,\"M/Ž 75\",IF(D142>1931,\"M/Ž 75+\",)))))))))))","v":"M/Ž 12"},"KLUB ",{"$f":"VLOOKUP(A142,STARTNA!$A$12:$H$96,6,)","v":"KLUB "}]
[]
[]
[null,"PODACI O UVJETIMA NA STAZI:"]
[]
[null,"Temperatura zraka:","31°"]
[null,"Temperatura mora:","24°"]
[null,"Snaga mora:",0]
[null,"Smjer vjetra:",0]
[null,"Jačina vjetra:",0]
[]
[]
[" "]

{"sheet":"ciljna nesl","index":1,"n_rows":72,"n_cols":14,"rows_kept":72,"cut":false,"hidden":false,"merged":[[4,0,4,8],[5,13,5,16],[6,13,6,16],[71,0,76,8]]}
[]
[]
[]
[]
["299 OTVORENO PRVENSTVO DALMACIJE U DALJINSKOM PLIVANJU - OMIŠ 2022.",null,null,null,null,null,null,null,null,null,null,null,null,"1. Lozinka  \"h\" je stalno aktivna"]
[null,null,null,null,null,null,null,null,null,null,null,null,null,"2. Upisivati startne brojeve s ramena u stupac B prema postignutom rangu"]
[null,"dionica - 1501 metar",null,null,null,"Omiš, 20. 8. 2022.",null,null,null,null,null,null,null,"   3. U novi red prelaziti s TAB"]
[null,null,null,null,null,null,null,null,null,null,null,null,null,"4. Skinuti zaštitu i u stupac „I” upisati rezultate na način XX,XX  (28,57)"]
[null,null,"neslužbena  CILJNA LISTA  "]
[null,null,null,null,null,null,null,null,null,null,null,null,null,"5. Po upisu zadnjeg rezultata snimiti podatke"]
["rang","ST. BR","PREZIME I IME","S","GOD","KAT","klub/rekr","MJESTO","rez","DOM","IK",null,null,"6. Kopirati podatke od stupca B – K i zalijepiti u CILJNU služb."]
[1,32,{"$f":"VLOOKUP(B12,STARTNA!$A$12:$H$96,2,)","v":"TAFRA MATE"},{"$f":"VLOOKUP(B12,STARTNA!$A$12:$H$96,3,)","v":"M"},{"$f":"VLOOKUP(B12,STARTNA!$A$12:$H$96,4,)","v":2009},{"$f":"VLOOKUP(B12,STARTNA!$A$12:$H$96,5,)","v":"M/Ž 19"},{"$f":"VLOOKUP(B12,STARTNA!$A$12:$H$96,6,)","v":"REKR"},{"$f":"VLOOKUP(B12,STARTNA!$A$12:$H$96,7,)","v":"OMIŠ"},18.11,{"$f":"IF($H$12:$H$98=\"Omiš\",\"DOM\",)","v":"DOM"},{"$f":"AND(E12<2014,G12=\"KLUB\")","v":false},null,null,"7. Zaštititi list"]
[2,25,"BRATIĆ DAMIR","M",2012,{"$f":"IF(E13>2012,\"M/Ž 12\",IF(E13>2009,\"M/Ž 15\",IF(E13>2005,\"M/Ž 19\",IF(E13>1995,\"M/Ž 29\",IF(E13>1985,\"M/Ž 39\",IF(E13>1975,\"M/Ž 49\",IF(E13>1965,\"M/Ž 59\",IF(E13>1959,\"M/Ž 65\",IF(E13>1954,\"M/Ž 70\",IF(E13>1949,\"M/Ž 75\",IF(E13>1931,\"M/Ž 75+\",)))))))))))","v":"M/Ž 15"},"REKR","SPLIT",18.489999999999998,0,1]
[3,34,{"$f":"VLOOKUP(B14,STARTNA!$A$12:$H$96,2,)","v":"LATINOVIĆ SRĐAN"},{"$f":"VLOOKUP(B14,STARTNA!$A$12:$H$96,3,)","v":"M"},{"$f":"VLOOKUP(B14,STARTNA!$A$12:$H$96,4,)","v":1988},{"$f":"VLOOKUP(B14,STARTNA!$A$12:$H$96,5,)","v":"M/Ž 39"},{"$f":"VLOOKUP(B14,STARTNA!$A$12:$H$96,6,)","v":"REKR"},{"$f":"VLOOKUP(B14,STARTNA!$A$12:$H$96,7,)","v":"SPLIT"},19.11,0,false]
[4,29,{"$f":"VLOOKUP(B15,STARTNA!$A$12:$H$96,2,)","v":"STOJANOVIĆ MIHOVIL"},{"$f":"VLOOKUP(B15,STARTNA!$A$12:$H$96,3,)","v":"M"},{"$f":"VLOOKUP(B15,STARTNA!$A$12:$H$96,4,)","v":1985},{"$f":"VLOOKUP(B15,STARTNA!$A$12:$H$96,5,)","v":"M/Ž 49"},{"$f":"VLOOKUP(B15,STARTNA!$A$12:$H$96,6,)","v":"REKR"},{"$f":"VLOOKUP(B15,STARTNA!$A$12:$H$96,7,)","v":"DRNIŠ"},19.16,0,false]
[5,39,{"$f":"VLOOKUP(B16,STARTNA!$A$12:$H$96,2,)","v":"BOBANOVIĆ NIKO"},{"$f":"VLOOKUP(B16,STARTNA!$A$12:$H$96,3,)","v":"M"},{"$f":"VLOOKUP(B16,STARTNA!$A$12:$H$96,4,)","v":2012},{"$f":"VLOOKUP(B16,STARTNA!$A$12:$H$96,5,)","v":"M/Ž 15"},{"$f":"VLOOKUP(B16,STARTNA!$A$12:$H$96,6,)","v":"REKR"},{"$f":"VLOOKUP(B16,STARTNA!$A$12:$H$96,7,)","v":"SPLIT"},20.03,0,false]
[6,31,{"$f":"VLOOKUP(B17,STARTNA!$A$12:$H$96,2,)","v":"GALIĆ PETRA"},{"$f":"VLOOKUP(B17,STARTNA!$A$12:$H$96,3,)","v":"Ž"},{"$f":"VLOOKUP(B17,STARTNA!$A$12:$H$96,4,)","v":2010},{"$f":"VLOOKUP(B17,STARTNA!$A$12:$H$96,5,)","v":"M/Ž 15"},{"$f":"VLOOKUP(B17,STARTNA!$A$12:$H$96,6,)","v":"REKR"},{"$f":"VLOOKUP(B17,STARTNA!$A$12:$H$96,7,)","v":"SPLIT"},20.16,0,false]
[7,23,{"$f":"VLOOKUP(B18,STARTNA!$A$12:$H$96,2,)","v":"KUNDID IGOR"},{"$f":"VLOOKUP(B18,STARTNA!$A$12:$H$96,3,)","v":"M"},{"$f":"VLOOKUP(B18,STARTNA!$A$12:$H$96,4,)","v":1981},{"$f":"VLOOKUP(B18,STARTNA!$A$12:$H$96,5,)","v":"M/Ž 49"},{"$f":"VLOOKUP(B18,STARTNA!$A$12:$H$96,6,)","v":"REKR"},{"$f":"VLOOKUP(B18,STARTNA!$A$12:$H$96,7,)","v":"STOBREČ"},20.34,0,false]
[8,44,{"$f":"VLOOKUP(B19,STARTNA!$A$12:$H$96,2,)","v":"GABELLINI DIEGO"},{"$f":"VLOOKUP(B19,STARTNA!$A$12:$H$96,3,)","v":"M"},{"$f":"VLOOKUP(B19,STARTNA!$A$12:$H$96,4,)","v":2013},{"$f":"VLOOKUP(B19,STARTNA!$A$12:$H$96,5,)","v":"M/Ž 12"},{"$f":"VLOOKUP(B19,STARTNA!$A$12:$H$96,6,)","v":"REKR"},{"$f":"VLOOKUP(B19,STARTNA!$A$12:$H$96,7,)","v":"ITALIJA"},20.45,0,false]
[9,2,{"$f":"VLOOKUP(B20,STARTNA!$A$12:$H$96,2,)","v":"VIDEKOVIĆ UNA"},{"$f":"VLOOKUP(B20,STARTNA!$A$12:$H$96,3,)","v":"Ž"},{"$f":"VLOOKUP(B20,STARTNA!$A$12:$H$96,4,)","v":2011},{"$f":"VLOOKUP(B20,STARTNA!$A$12:$H$96,5,)","v":"M/Ž 15"},{"$f":"VLOOKUP(B20,STARTNA!$A$12:$H$96,6,)","v":"KLUB "},{"$f":"VLOOKUP(B20,STARTNA!$A$12:$H$96,7,)","v":"VINKOVCI"},20.51,0,1]
[10,28,{"$f":"VLOOKUP(B21,STARTNA!$A$12:$H$96,2,)","v":"ZEKANOVIĆ MIA"},{"$f":"VLOOKUP(B21,STARTNA!$A$12:$H$96,3,)","v":"Ž"},{"$f":"VLOOKUP(B21,STARTNA!$A$12:$H$96,4,)","v":2010},{"$f":"VLOOKUP(B21,STARTNA!$A$12:$H$96,5,)","v":"M/Ž 15"},{"$f":"VLOOKUP(B21,STARTNA!$A$12:$H$96,6,)","v":"REKR"},{"$f":"VLOOKUP(B21,STARTNA!$A$12:$H$96,7,)","v":"ZADAR"},20.58,0,{"$f":"AND(E21<2014,G21=\"KLUB\")","v":false}]
[11,37,{"$f":"VLOOKUP(B22,STARTNA!$A$12:$H$96,2,)","v":"JAKOVČIĆ ROZA"},{"$f":"VLOOKUP(B22,STARTNA!$A$12:$H$96,3,)","v":"Ž"},{"$f":"VLOOKUP(B22,STARTNA!$A$12:$H$96,4,)","v":2012},{"$f":"VLOOKUP(B22,STARTNA!$A$12:$H$96,5,)","v":"M/Ž 15"},{"$f":"VLOOKUP(B22,STARTNA!$A$12:$H$96,6,)","v":"REKR"},{"$f":"VLOOKUP(B22,STARTNA!$A$12:$H$96,7,)","v":"OMIŠ"},21.02,"DOM",{"$f":"AND(E22<2014,G22=\"KLUB\")","v":false}]
[12,10,{"$f":"VLOOKUP(B23,STARTNA!$A$12:$H$96,2,)","v":"RADNIĆ GEA"},{"$f":"VLOOKUP(B23,STARTNA!$A$12:$H$96,3,)","v":"Ž"},{"$f":"VLOOKUP(B23,STARTNA!$A$12:$H$96,4,)","v":2013},{"$f":"VLOOKUP(B23,STARTNA!$A$12:$H$96,5,)","v":"M/Ž 12"},{"$f":"VLOOKUP(B23,STARTNA!$A$12:$H$96,6,)","v":"KLUB "},{"$f":"VLOOKUP(B23,STARTNA!$A$12:$H$96,7,)","v":"SPLIT"},21.08,0,1]
[13,30,{"$f":"VLOOKUP(B24,STARTNA!$A$12:$H$96,2,)","v":"BRZOVIĆ ANA"},{"$f":"VLOOKUP(B24,STARTNA!$A$12:$H$96,3,)","v":"Ž"},{"$f":"VLOOKUP(B24,STARTNA!$A$12:$H$96,4,)","v":2008},{"$f":"VLOOKUP(B24,STARTNA!$A$12:$H$96,5,)","v":"M/Ž 19"},{"$f":"VLOOKUP(B24,STARTNA!$A$12:$H$96,6,)","v":"REKR"},{"$f":"VLOOKUP(B24,STARTNA!$A$12:$H$96,7,)","v":"OMIŠ"},21.13,"DOM",{"$f":"AND(E24<2014,G24=\"KLUB\")","v":false}]
[14,54,{"$f":"VLOOKUP(B25,STARTNA!$A$12:$H$96,2,)","v":"BEBIĆ MIJO"},{"$f":"VLOOKUP(B25,STARTNA!$A$12:$H$96,3,)","v":"M"},{"$f":"VLOOKUP(B25,STARTNA!$A$12:$H$96,4,)","v":1978},{"$f":"VLOOKUP(B25,STARTNA!$A$12:$H$96,5,)","v":"M/Ž 49"},{"$f":"VLOOKUP(B25,STARTNA!$A$12:$H$96,6,)","v":"REKR"},{"$f":"VLOOKUP(B25,STARTNA!$A$12:$H$96,7,)","v":"SPLIT"},21.17,0,false]
[15,33,{"$f":"VLOOKUP(B26,STARTNA!$A$12:$H$96,2,)","v":"BOŽAN LUKA"},{"$f":"VLOOKUP(B26,STARTNA!$A$12:$H$96,3,)","v":"M"},{"$f":"VLOOKUP(B26,STARTNA!$A$12:$H$96,4,)","v":2010},{"$f":"VLOOKUP(B26,STARTNA!$A$12:$H$96,5,)","v":"M/Ž 15"},{"$f":"VLOOKUP(B26,STARTNA!$A$12:$H$96,6,)","v":"REKR"},{"$f":"VLOOKUP(B26,STARTNA!$A$12:$H$96,7,)","v":"ZAGREB"},21,0,false]
[16,1,{"$f":"VLOOKUP(B27,STARTNA!$A$12:$H$96,2,)","v":"PRVAN BORKO"},{"$f":"VLOOKUP(B27,STARTNA!$A$12:$H$96,3,)","v":"M"},{"$f":"VLOOKUP(B27,STARTNA!$A$12:$H$96,4,)","v":1951},{"$f":"VLOOKUP(B27,STARTNA!$A$12:$H$96,5,)","v":"M/Ž 75"},{"$f":"VLOOKUP(B27,STARTNA!$A$12:$H$96,6,)","v":"REKR"},{"$f":"VLOOKUP(B27,STARTNA!$A$12:$H$96,7,)","v":"ZAGREB"},21.51,0,false]
[17,49,{"$f":"VLOOKUP(B28,STARTNA!$A$12:$H$96,2,)","v":"PULIĆ JOŠKO"},{"$f":"VLOOKUP(B28,STARTNA!$A$12:$H$96,3,)","v":"M"},{"$f":"VLOOKUP(B28,STARTNA!$A$12:$H$96,4,)","v":1981},{"$f":"VLOOKUP(B28,STARTNA!$A$12:$H$96,5,)","v":"M/Ž 49"},{"$f":"VLOOKUP(B28,STARTNA!$A$12:$H$96,6,)","v":"REKR"},{"$f":"VLOOKUP(B28,STARTNA!$A$12:$H$96,7,)","v":"DUBROVNIK"},22.11,0,false]
[18,27,{"$f":"VLOOKUP(B29,STARTNA!$A$12:$H$96,2,)","v":"GRUBIŠIĆ DRAGAN"},{"$f":"VLOOKUP(B29,STARTNA!$A$12:$H$96,3,)","v":"M"},{"$f":"VLOOKUP(B29,STARTNA!$A$12:$H$96,4,)","v":1968},{"$f":"VLOOKUP(B29,STARTNA!$A$12:$H$96,5,)","v":"M/Ž 59"},{"$f":"VLOOKUP(B29,STARTNA!$A$12:$H$96,6,)","v":"REKR"},{"$f":"VLOOKUP(B29,STARTNA!$A$12:$H$96,7,)","v":"ŠIBENIK"},22.24,0,false]
[19,11,{"$f":"VLOOKUP(B30,STARTNA!$A$12:$H$96,2,)","v":"BRKOVIĆ MARIN"},{"$f":"VLOOKUP(B30,STARTNA!$A$12:$H$96,3,)","v":"M"},{"$f":"VLOOKUP(B30,STARTNA!$A$12:$H$96,4,)","v":2015},{"$f":"VLOOKUP(B30,STARTNA!$A$12:$H$96,5,)","v":"M/Ž 12"},{"$f":"VLOOKUP(B30,STARTNA!$A$12:$H$96,6,)","v":"KLUB "},{"$f":"VLOOKUP(B30,STARTNA!$A$12:$H$96,7,)","v":"SPLIT"},25.09,0,false]
[20,19,{"$f":"VLOOKUP(B31,STARTNA!$A$12:$H$96,2,)","v":"GRGAT MARIJO"},{"$f":"VLOOKUP(B31,STARTNA!$A$12:$H$96,3,)","v":"M"},{"$f":"VLOOKUP(B31,STARTNA!$A$12:$H$96,4,)","v":1974},{"$f":"VLOOKUP(B31,STARTNA!$A$12:$H$96,5,)","v":"M/Ž 59"},{"$f":"VLOOKUP(B31,STARTNA!$A$12:$H$96,6,)","v":"REKR"},{"$f":"VLOOKUP(B31,STARTNA!$A$12:$H$96,7,)","v":"DUGI RAT"},25.37,0,false]
[21,45,{"$f":"VLOOKUP(B32,STARTNA!$A$12:$H$96,2,)","v":"MANDUŠIĆ IGOR"},{"$f":"VLOOKUP(B32,STARTNA!$A$12:$H$96,3,)","v":"M"},{"$f":"VLOOKUP(B32,STARTNA!$A$12:$H$96,4,)","v":1974},{"$f":"VLOOKUP(B32,STARTNA!$A$12:$H$96,5,)","v":"M/Ž 59"},{"$f":"VLOOKUP(B32,STARTNA!$A$12:$H$96,6,)","v":"REKR"},{"$f":"VLOOKUP(B32,STARTNA!$A$12:$H$96,7,)","v":"TROGIR"},25.46,0,false]
[22,22,{"$f":"VLOOKUP(B33,STARTNA!$A$12:$H$96,2,)","v":"BALIĆ ANTE"},{"$f":"VLOOKUP(B33,STARTNA!$A$12:$H$96,3,)","v":"M"},{"$f":"VLOOKUP(B33,STARTNA!$A$12:$H$96,4,)","v":1981},{"$f":"VLOOKUP(B33,STARTNA!$A$12:$H$96,5,)","v":"M/Ž 49"},{"$f":"VLOOKUP(B33,STARTNA!$A$12:$H$96,6,)","v":"REKR"},{"$f":"VLOOKUP(B33,STARTNA!$A$12:$H$96,7,)","v":"ZAGREB"},25.5,0,false]
[23,38,{"$f":"VLOOKUP(B34,STARTNA!$A$12:$H$96,2,)","v":"BOBANOVIĆ PETAR"},{"$f":"VLOOKUP(B34,STARTNA!$A$12:$H$96,3,)","v":"M"},{"$f":"VLOOKUP(B34,STARTNA!$A$12:$H$96,4,)","v":2015},{"$f":"VLOOKUP(B34,STARTNA!$A$12:$H$96,5,)","v":"M/Ž 12"},{"$f":"VLOOKUP(B34,STARTNA!$A$12:$H$96,6,)","v":"REKR"},{"$f":"VLOOKUP(B34,STARTNA!$A$12:$H$96,7,)","v":"SPLIT"},26.09,0,false]
[24,40,{"$f":"VLOOKUP(B35,STARTNA!$A$12:$H$96,2,)","v":"BOBANOVIĆ HRVOJE"},{"$f":"VLOOKUP(B35,STARTNA!$A$12:$H$96,3,)","v":"M"},{"$f":"VLOOKUP(B35,STARTNA!$A$12:$H$96,4,)","v":1979},{"$f":"VLOOKUP(B35,STARTNA!$A$12:$H$96,5,)","v":"M/Ž 49"},{"$f":"VLOOKUP(B35,STARTNA!$A$12:$H$96,6,)","v":"REKR"},{"$f":"VLOOKUP(B35,STARTNA!$A$12:$H$96,7,)","v":"SPLIT"},26.12,0,false]
[25,24,{"$f":"VLOOKUP(B36,STARTNA!$A$12:$H$96,2,)","v":"KUNDID TONI"},{"$f":"VLOOKUP(B36,STARTNA!$A$12:$H$96,3,)","v":"M"},{"$f":"VLOOKUP(B36,STARTNA!$A$12:$H$96,4,)","v":2014},{"$f":"VLOOKUP(B36,STARTNA!$A$12:$H$96,5,)","v":"M/Ž 12"},{"$f":"VLOOKUP(B36,STARTNA!$A$12:$H$96,6,)","v":"REKR "},{"$f":"VLOOKUP(B36,STARTNA!$A$12:$H$96,7,)","v":"STOBREČ"},26.2,0,false]
[26,21,{"$f":"VLOOKUP(B37,STARTNA!$A$12:$H$96,2,)","v":"ARAPOVIĆ ANA"},{"$f":"VLOOKUP(B37,STARTNA!$A$12:$H$96,3,)","v":"Ž"},{"$f":"VLOOKUP(B37,STARTNA!$A$12:$H$96,4,)","v":1982},{"$f":"VLOOKUP(B37,STARTNA!$A$12:$H$96,5,)","v":"M/Ž 49"},{"$f":"VLOOKUP(B37,STARTNA!$A$12:$H$96,6,)","v":"REKR"},{"$f":"VLOOKUP(B37,STARTNA!$A$12:$H$96,7,)","v":"SPLIT"},26.3,0,false]
[27,16,{"$f":"VLOOKUP(B38,STARTNA!$A$12:$H$96,2,)","v":"BILANOVIĆ JURE"},{"$f":"VLOOKUP(B38,STARTNA!$A$12:$H$96,3,)","v":"M"},{"$f":"VLOOKUP(B38,STARTNA!$A$12:$H$96,4,)","v":1981},{"$f":"VLOOKUP(B38,STARTNA!$A$12:$H$96,5,)","v":"M/Ž 49"},{"$f":"VLOOKUP(B38,STARTNA!$A$12:$H$96,6,)","v":"REKR"},{"$f":"VLOOKUP(B38,STARTNA!$A$12:$H$96,7,)","v":"DUGI RAT"},26.53,0,false]
[28,47,{"$f":"VLOOKUP(B39,STARTNA!$A$12:$H$96,2,)","v":"ČAGALJ VICKO"},{"$f":"VLOOKUP(B39,STARTNA!$A$12:$H$96,3,)","v":"M"},{"$f":"VLOOKUP(B39,STARTNA!$A$12:$H$96,4,)","v":1993},{"$f":"VLOOKUP(B39,STARTNA!$A$12:$H$96,5,)","v":"M/Ž 39"},{"$f":"VLOOKUP(B39,STARTNA!$A$12:$H$96,6,)","v":"REKR"},{"$f":"VLOOKUP(B39,STARTNA!$A$12:$H$96,7,)","v":"ZAGREB"},27.2,0,false]
[29,35,{"$f":"VLOOKUP(B40,STARTNA!$A$12:$H$96,2,)","v":"ŠOŠIĆ MARKO"},{"$f":"VLOOKUP(B40,STARTNA!$A$12:$H$96,3,)","v":"M"},{"$f":"VLOOKUP(B40,STARTNA!$A$12:$H$96,4,)","v":1985},{"$f":"VLOOKUP(B40,STARTNA!$A$12:$H$96,5,)","v":"M/Ž 49"},{"$f":"VLOOKUP(B40,STARTNA!$A$12:$H$96,6,)","v":"REKR"},{"$f":"VLOOKUP(B40,STARTNA!$A$12:$H$96,7,)","v":"BRELA"},27.21,0,false]
[30,55,{"$f":"VLOOKUP(B41,STARTNA!$A$12:$H$96,2,)","v":"PIVČEVIĆ IVO"},{"$f":"VLOOKUP(B41,STARTNA!$A$12:$H$96,3,)","v":"M"},{"$f":"VLOOKUP(B41,STARTNA!$A$12:$H$96,4,)","v":1993},{"$f":"VLOOKUP(B41,STARTNA!$A$12:$H$96,5,)","v":"M/Ž 39"},{"$f":"VLOOKUP(B41,STARTNA!$A$12:$H$96,6,)","v":"REKR"},{"$f":"VLOOKUP(B41,STARTNA!$A$12:$H$96,7,)","v":"OMIŠ"},27.34,"DOM",false]
[31,18,{"$f":"VLOOKUP(B42,STARTNA!$A$12:$H$96,2,)","v":"TOMIĆ ZORAN"},{"$f":"VLOOKUP(B42,STARTNA!$A$12:$H$96,3,)","v":"M"},{"$f":"VLOOKUP(B42,STARTNA!$A$12:$H$96,4,)","v":1974},{"$f":"VLOOKUP(B42,STARTNA!$A$12:$H$96,5,)","v":"M/Ž 59"},{"$f":"VLOOKUP(B42,STARTNA!$A$12:$H$96,6,)","v":"REKR"},{"$f":"VLOOKUP(B42,STARTNA!$A$12:$H$96,7,)","v":"SPLIT"},27.38,0,false]
[32,9,{"$f":"VLOOKUP(B43,STARTNA!$A$12:$H$96,2,)","v":"KNEŽEVIĆ FILIP"},{"$f":"VLOOKUP(B43,STARTNA!$A$12:$H$96,3,)","v":"M"},{"$f":"VLOOKUP(B43,STARTNA!$A$12:$H$96,4,)","v":1995},{"$f":"VLOOKUP(B43,STARTNA!$A$12:$H$96,5,)","v":"M/Ž 39"},{"$f":"VLOOKUP(B43,STARTNA!$A$12:$H$96,6,)","v":"REKR"},{"$f":"VLOOKUP(B43,STARTNA!$A$12:$H$96,7,)","v":"ŠIBENIK"},27.45,0,false]
[33,52,{"$f":"VLOOKUP(B44,STARTNA!$A$12:$H$96,2,)","v":"STANIĆ CVITA"},{"$f":"VLOOKUP(B44,STARTNA!$A$12:$H$96,3,)","v":"Ž"},{"$f":"VLOOKUP(B44,STARTNA!$A$12:$H$96,4,)","v":2011},{"$f":"VLOOKUP(B44,STARTNA!$A$12:$H$96,5,)","v":"M/Ž 15"},{"$f":"VLOOKUP(B44,STARTNA!$A$12:$H$96,6,)","v":"REKR"},{"$f":"VLOOKUP(B44,STARTNA!$A$12:$H$96,7,)","v":"OMIŠ"},27.46,{"$f":"IF($H$12:$H$98=\"Omiš\",\"DOM\",)","v":"DOM"},false]
[34,7,{"$f":"VLOOKUP(B45,STARTNA!$A$12:$H$96,2,)","v":"KEKEZ ANTE"},{"$f":"VLOOKUP(B45,STARTNA!$A$12:$H$96,3,)","v":"M"},{"$f":"VLOOKUP(B45,STARTNA!$A$12:$H$96,4,)","v":1950},{"$f":"VLOOKUP(B45,STARTNA!$A$12:$H$96,5,)","v":"M/Ž 75"},{"$f":"VLOOKUP(B45,STARTNA!$A$12:$H$96,6,)","v":"REKR"},{"$f":"VLOOKUP(B45,STARTNA!$A$12:$H$96,7,)","v":"OMIŠ"},27.48,"DOM",false]
[35,50,{"$f":"VLOOKUP(B46,STARTNA!$A$12:$H$96,2,)","v":"PERAK MARIJA"},{"$f":"VLOOKUP(B46,STARTNA!$A$12:$H$96,3,)","v":"Ž"},{"$f":"VLOOKUP(B46,STARTNA!$A$12:$H$96,4,)","v":2012},{"$f":"VLOOKUP(B46,STARTNA!$A$12:$H$96,5,)","v":"M/Ž 15"},{"$f":"VLOOKUP(B46,STARTNA!$A$12:$H$96,6,)","v":"REKR"},{"$f":"VLOOKUP(B46,STARTNA!$A$12:$H$96,7,)","v":"OMIŠ"},27.51,"DOM",false]
[36,5,{"$f":"VLOOKUP(B47,STARTNA!$A$12:$H$96,2,)","v":"KAČIĆ ZORAN"},{"$f":"VLOOKUP(B47,STARTNA!$A$12:$H$96,3,)","v":"M"},{"$f":"VLOOKUP(B47,STARTNA!$A$12:$H$96,4,)","v":1950},{"$f":"VLOOKUP(B47,STARTNA!$A$12:$H$96,5,)","v":"M/Ž 75"},{"$f":"VLOOKUP(B47,STARTNA!$A$12:$H$96,6,)","v":"REKR"},{"$f":"VLOOKUP(B47,STARTNA!$A$12:$H$96,7,)","v":"SPLIT"},28.16,0,false]
[37,43,{"$f":"VLOOKUP(B48,STARTNA!$A$12:$H$96,2,)","v":"BAŠIĆ VEDRAN"},{"$f":"VLOOKUP(B48,STARTNA!$A$12:$H$96,3,)","v":"M"},{"$f":"VLOOKUP(B48,STARTNA!$A$12:$H$96,4,)","v":1975},{"$f":"VLOOKUP(B48,STARTNA!$A$12:$H$96,5,)","v":"M/Ž 59"},{"$f":"VLOOKUP(B48,STARTNA!$A$12:$H$96,6,)","v":"REKR"},{"$f":"VLOOKUP(B48,STARTNA!$A$12:$H$96,7,)","v":"SPLIT"},28.24,0,false]
[38,53,{"$f":"VLOOKUP(B49,STARTNA!$A$12:$H$96,2,)","v":"STANIĆ LEA"},{"$f":"VLOOKUP(B49,STARTNA!$A$12:$H$96,3,)","v":"Ž"},{"$f":"VLOOKUP(B49,STARTNA!$A$12:$H$96,4,)","v":2012},{"$f":"VLOOKUP(B49,STARTNA!$A$12:$H$96,5,)","v":"M/Ž 15"},{"$f":"VLOOKUP(B49,STARTNA!$A$12:$H$96,6,)","v":"REKR"},{"$f":"VLOOKUP(B49,STARTNA!$A$12:$H$96,7,)","v":"OMIŠ"},29.05,"DOM",false]
[39,46,{"$f":"VLOOKUP(B50,STARTNA!$A$12:$H$96,2,)","v":"MEKINIĆ PETAR"},{"$f":"VLOOKUP(B50,STARTNA!$A$12:$H$96,3,)","v":"M"},{"$f":"VLOOKUP(B50,STARTNA!$A$12:$H$96,4,)","v":2006},{"$f":"VLOOKUP(B50,STARTNA!$A$12:$H$96,5,)","v":"M/Ž 19"},{"$f":"VLOOKUP(B50,STARTNA!$A$12:$H$96,6,)","v":"REKR"},{"$f":"VLOOKUP(B50,STARTNA!$A$12:$H$96,7,)","v":"OMIŠ"},29.27,"DOM",false]
[40,51,{"$f":"VLOOKUP(B51,STARTNA!$A$12:$H$96,2,)","v":"DRAGOŠEVIĆ ELA"},{"$f":"VLOOKUP(B51,STARTNA!$A$12:$H$96,3,)","v":"Ž"},{"$f":"VLOOKUP(B51,STARTNA!$A$12:$H$96,4,)","v":2012},{"$f":"VLOOKUP(B51,STARTNA!$A$12:$H$96,5,)","v":"M/Ž 15"},{"$f":"VLOOKUP(B51,STARTNA!$A$12:$H$96,6,)","v":"REKR"},{"$f":"VLOOKUP(B51,STARTNA!$A$12:$H$96,7,)","v":"OMIŠ"},29.34,"DOM",false]
[41,26,{"$f":"VLOOKUP(B52,STARTNA!$A$12:$H$96,2,)","v":"GRUBIŠIĆ INES"},{"$f":"VLOOKUP(B52,STARTNA!$A$12:$H$96,3,)","v":"Ž"},{"$f":"VLOOKUP(B52,STARTNA!$A$12:$H$96,4,)","v":1995},{"$f":"VLOOKUP(B52,STARTNA!$A$12:$H$96,5,)","v":"M/Ž 39"},{"$f":"VLOOKUP(B52,STARTNA!$A$12:$H$96,6,)","v":"REKR"},{"$f":"VLOOKUP(B52,STARTNA!$A$12:$H$96,7,)","v":"ZAGREB"},29.41,0,false]
[42,15,{"$f":"VLOOKUP(B53,STARTNA!$A$12:$H$96,2,)","v":"LIPNJAK TAMARA"},{"$f":"VLOOKUP(B53,STARTNA!$A$12:$H$96,3,)","v":"Ž"},{"$f":"VLOOKUP(B53,STARTNA!$A$12:$H$96,4,)","v":1992},{"$f":"VLOOKUP(B53,STARTNA!$A$12:$H$96,5,)","v":"M/Ž 39"},{"$f":"VLOOKUP(B53,STARTNA!$A$12:$H$96,6,)","v":"REKR"},{"$f":"VLOOKUP(B53,STARTNA!$A$12:$H$96,7,)","v":"ZAGREB"},31.19,0,false]
[43,6,{"$f":"VLOOKUP(B54,STARTNA!$A$12:$H$96,2,)","v":"KAČIĆ DUPLANČIĆ DIANA"},{"$f":"VLOOKUP(B54,STARTNA!$A$12:$H$96,3,)","v":"Ž"},{"$f":"VLOOKUP(B54,STARTNA!$A$12:$H$96,4,)","v":1978},{"$f":"VLOOKUP(B54,STARTNA!$A$12:$H$96,5,)","v":"M/Ž 49"},{"$f":"VLOOKUP(B54,STARTNA!$A$12:$H$96,6,)","v":"REKR"},{"$f":"VLOOKUP(B54,STARTNA!$A$12:$H$96,7,)","v":"SPLIT"},31.33,0,false]
[44,42,{"$f":"VLOOKUP(B55,STARTNA!$A$12:$H$96,2,)","v":"BOBAN HRVOJE"},{"$f":"VLOOKUP(B55,STARTNA!$A$12:$H$96,3,)","v":"M"},{"$f":"VLOOKUP(B55,STARTNA!$A$12:$H$96,4,)","v":1976},{"$f":"VLOOKUP(B55,STARTNA!$A$12:$H$96,5,)","v":"M/Ž 49"},{"$f":"VLOOKUP(B55,STARTNA!$A$12:$H$96,6,)","v":"REKR"},{"$f":"VLOOKUP(B55,STARTNA!$A$12:$H$96,7,)","v":"SPLIT"},31.47,0,false]
[45,8,{"$f":"VLOOKUP(B56,STARTNA!$A$12:$H$96,2,)","v":"VERINA MARIA "},{"$f":"VLOOKUP(B56,STARTNA!$A$12:$H$96,3,)","v":"Ž"},{"$f":"VLOOKUP(B56,STARTNA!$A$12:$H$96,4,)","v":1965},{"$f":"VLOOKUP(B56,STARTNA!$A$12:$H$96,5,)","v":"M/Ž 65"},{"$f":"VLOOKUP(B56,STARTNA!$A$12:$H$96,6,)","v":"REKR"},{"$f":"VLOOKUP(B56,STARTNA!$A$12:$H$96,7,)","v":"SUTIVAN"},32.020000000000003,0,false]
[46,17,{"$f":"VLOOKUP(B57,STARTNA!$A$12:$H$96,2,)","v":"BELOUSOVA MARIA"},{"$f":"VLOOKUP(B57,STARTNA!$A$12:$H$96,3,)","v":"Ž"},{"$f":"VLOOKUP(B57,STARTNA!$A$12:$H$96,4,)","v":2012},{"$f":"VLOOKUP(B57,STARTNA!$A$12:$H$96,5,)","v":"M/Ž 15"},{"$f":"VLOOKUP(B57,STARTNA!$A$12:$H$96,6,)","v":"KLUB "},{"$f":"VLOOKUP(B57,STARTNA!$A$12:$H$96,7,)","v":"BRASINA"},32.090000000000003,0,1]
[47,20,{"$f":"VLOOKUP(B58,STARTNA!$A$12:$H$96,2,)","v":"LUKIĆ ZITA"},{"$f":"VLOOKUP(B58,STARTNA!$A$12:$H$96,3,)","v":"Ž"},{"$f":"VLOOKUP(B58,STARTNA!$A$12:$H$96,4,)","v":2002},{"$f":"VLOOKUP(B58,STARTNA!$A$12:$H$96,5,)","v":"M/Ž 29"},{"$f":"VLOOKUP(B58,STARTNA!$A$12:$H$96,6,)","v":"REKR"},{"$f":"VLOOKUP(B58,STARTNA!$A$12:$H$96,7,)","v":"SPLIT"},32.119999999999997,0,{"$f":"AND(E58<2014,G58=\"KLUB\")","v":false}]
[48,36,{"$f":"VLOOKUP(B59,STARTNA!$A$12:$H$96,2,)","v":"JAKOVČIĆ FABJANA"},{"$f":"VLOOKUP(B59,STARTNA!$A$12:$H$96,3,)","v":"Ž"},{"$f":"VLOOKUP(B59,STARTNA!$A$12:$H$96,4,)","v":1975},{"$f":"VLOOKUP(B59,STARTNA!$A$12:$H$96,5,)","v":"M/Ž 59"},{"$f":"VLOOKUP(B59,STARTNA!$A$12:$H$96,6,)","v":"REKR"},{"$f":"VLOOKUP(B59,STARTNA!$A$12:$H$96,7,)","v":"OMIŠ"},32.25,"DOM",false]
[49,4,{"$f":"VLOOKUP(B60,STARTNA!$A$12:$H$96,2,)","v":"ĆOSIĆ HRVOJE"},{"$f":"VLOOKUP(B60,STARTNA!$A$12:$H$96,3,)","v":"M"},{"$f":"VLOOKUP(B60,STARTNA!$A$12:$H$96,4,)","v":1959},{"$f":"VLOOKUP(B60,STARTNA!$A$12:$H$96,5,)","v":"M/Ž 70"},{"$f":"VLOOKUP(B60,STARTNA!$A$12:$H$96,6,)","v":"REKR"},{"$f":"VLOOKUP(B60,STARTNA!$A$12:$H$96,7,)","v":"BIH"},34.07,0,false]
[50,12,{"$f":"VLOOKUP(B61,STARTNA!$A$12:$H$96,2,)","v":"DUMANIĆ NAĐAN"},{"$f":"VLOOKUP(B61,STARTNA!$A$12:$H$96,3,)","v":"M"},{"$f":"VLOOKUP(B61,STARTNA!$A$12:$H$96,4,)","v":1962},{"$f":"VLOOKUP(B61,STARTNA!$A$12:$H$96,5,)","v":"M/Ž 65"},{"$f":"VLOOKUP(B61,STARTNA!$A$12:$H$96,6,)","v":"REKR"},{"$f":"VLOOKUP(B61,STARTNA!$A$12:$H$96,7,)","v":"SPLIT"},34.11,0,false]
[51,14,{"$f":"VLOOKUP(B62,STARTNA!$A$12:$H$96,2,)","v":"ŠUŠNJAR PJERA"},{"$f":"VLOOKUP(B62,STARTNA!$A$12:$H$96,3,)","v":"Ž"},{"$f":"VLOOKUP(B62,STARTNA!$A$12:$H$96,4,)","v":1967},{"$f":"VLOOKUP(B62,STARTNA!$A$12:$H$96,5,)","v":"M/Ž 59"},{"$f":"VLOOKUP(B62,STARTNA!$A$12:$H$96,6,)","v":"REKR"},{"$f":"VLOOKUP(B62,STARTNA!$A$12:$H$96,7,)","v":"SPLIT"},34.450000000000003,0,false]
[52,57,{"$f":"VLOOKUP(B63,STARTNA!$A$12:$H$96,2,)","v":"ŠILJEG FILIPA"},{"$f":"VLOOKUP(B63,STARTNA!$A$12:$H$96,3,)","v":"Ž"},{"$f":"VLOOKUP(B63,STARTNA!$A$12:$H$96,4,)","v":2002},{"$f":"VLOOKUP(B63,STARTNA!$A$12:$H$96,5,)","v":"M/Ž 29"},{"$f":"VLOOKUP(B63,STARTNA!$A$12:$H$96,6,)","v":"REKR"},{"$f":"VLOOKUP(B63,STARTNA!$A$12:$H$96,7,)","v":"SPLIT"},34.520000000000003,0,false]
[53,3,{"$f":"VLOOKUP(B64,STARTNA!$A$12:$H$96,2,)","v":"ŠKORIĆ JOSIP"},{"$f":"VLOOKUP(B64,STARTNA!$A$12:$H$96,3,)","v":"M"},{"$f":"VLOOKUP(B64,STARTNA!$A$12:$H$96,4,)","v":1960},{"$f":"VLOOKUP(B64,STARTNA!$A$12:$H$96,5,)","v":"M/Ž 65"},{"$f":"VLOOKUP(B64,STARTNA!$A$12:$H$96,6,)","v":"REKR"},{"$f":"VLOOKUP(B64,STARTNA!$A$12:$H$96,7,)","v":"BIH"},35.04,0,false]
[54,48,{"$f":"VLOOKUP(B65,STARTNA!$A$12:$H$96,2,)","v":"TOMAŠ RADOSLAV"},{"$f":"VLOOKUP(B65,STARTNA!$A$12:$H$96,3,)","v":"M"},{"$f":"VLOOKUP(B65,STARTNA!$A$12:$H$96,4,)","v":1951},{"$f":"VLOOKUP(B65,STARTNA!$A$12:$H$96,5,)","v":"M/Ž 75"},{"$f":"VLOOKUP(B65,STARTNA!$A$12:$H$96,6,)","v":"REKR"},{"$f":"VLOOKUP(B65,STARTNA!$A$12:$H$96,7,)","v":"ZAGREB"},36.07,0,false]
[55,13,{"$f":"VLOOKUP(B66,STARTNA!$A$12:$H$96,2,)","v":"ŠUŠNJAR MARIN"},{"$f":"VLOOKUP(B66,STARTNA!$A$12:$H$96,3,)","v":"M"},{"$f":"VLOOKUP(B66,STARTNA!$A$12:$H$96,4,)","v":1961},{"$f":"VLOOKUP(B66,STARTNA!$A$12:$H$96,5,)","v":"M/Ž 65"},{"$f":"VLOOKUP(B66,STARTNA!$A$12:$H$96,6,)","v":"REKR"},{"$f":"VLOOKUP(B66,STARTNA!$A$12:$H$96,7,)","v":"SPLIT"},37.29,0,false]
[56,41,{"$f":"VLOOKUP(B67,STARTNA!$A$12:$H$96,2,)","v":"PERICA ŠINKA"},{"$f":"VLOOKUP(B67,STARTNA!$A$12:$H$96,3,)","v":"Ž"},{"$f":"VLOOKUP(B67,STARTNA!$A$12:$H$96,4,)","v":1966},{"$f":"VLOOKUP(B67,STARTNA!$A$12:$H$96,5,)","v":"M/Ž 59"},{"$f":"VLOOKUP(B67,STARTNA!$A$12:$H$96,6,)","v":"REKR"},{"$f":"VLOOKUP(B67,STARTNA!$A$12:$H$96,7,)","v":"OMIŠ"},39.44,"DOM",false]
[57,56,{"$f":"VLOOKUP(B68,STARTNA!$A$12:$H$96,2,)","v":"MIMICA MIROSLAV"},{"$f":"VLOOKUP(B68,STARTNA!$A$12:$H$96,3,)","v":"M"},{"$f":"VLOOKUP(B68,STARTNA!$A$12:$H$96,4,)","v":1958},{"$f":"VLOOKUP(B68,STARTNA!$A$12:$H$96,5,)","v":"M/Ž 70"},{"$f":"VLOOKUP(B68,STARTNA!$A$12:$H$96,6,)","v":"REKR"},{"$f":"VLOOKUP(B68,STARTNA!$A$12:$H$96,7,)","v":"DUGI RAT"},40.369999999999997,0,false]
[]
[]
[]
[" "]

{"sheet":"CILJNA služb","index":2,"n_rows":77,"n_cols":13,"rows_kept":77,"cut":false,"hidden":false,"merged":[[4,0,4,8],[4,12,4,14],[76,0,81,8]]}
[]
[]
[]
[]
["32. OTVORENO PRVENSTVO DALMACIJE U DALJINSKOM PLIVANJU - OMIŠ 2025.",null,null,null,null,null,null,null,null,null,null,null,"1. Skinuti zaštitu"]
[null,null,null,null,null,null,null,null,null,null,null,null,"2. Kopirati tablicu iz lista „CILJNA NESLUŽBENA”"]
[null,"dionica - 1501 metar",null,null,null,"Omiš, 23. 8. 2025.",null,null,null,null,null,null,"3. Staviti filter"]
[null,null,null,null,null,null,null,null,null,null,null,null,"4. Odabrati stupac K (IK)"]
[null,null,"službena   CILJNA LISTA  ",null,null,null,null,null,null,null,null,null,"5. Odabrati plivače IK"]
[null,null,null,null,null,null,null,null,null,null,null,null,"6. Kopirati plivače IK u tablicu „PLIVAČI IZVAN KONKURENCIJE”"]
["rang","ST. BR","PREZIME I IME","S","GOD","KAT","klub/rekr","MJESTO","rez","DOM","IK",null,"7. Označiti stupac A (Rang) plivača IK bojom"]
[1,32,{"$f":"VLOOKUP(B12,STARTNA!$A$12:$H$96,2,)","v":"TAFRA MATE"},{"$f":"VLOOKUP(B12,STARTNA!$A$12:$H$96,3,)","v":"M"},{"$f":"VLOOKUP(B12,STARTNA!$A$12:$H$96,4,)","v":2009},{"$f":"VLOOKUP(B12,STARTNA!$A$12:$H$96,5,)","v":"M/Ž 19"},{"$f":"VLOOKUP(B12,STARTNA!$A$12:$H$96,6,)","v":"REKR"},{"$f":"VLOOKUP(B12,STARTNA!$A$12:$H$96,7,)","v":"OMIŠ"},18.11,{"$f":"IF($H$12:$H$103=\"Omiš\",\"DOM\",)","v":"DOM"},{"$f":"AND(E12<2014,G12=\"KLUB\")","v":false},null,"8. Ukinuti filter"]
[2,34,{"$f":"VLOOKUP(B13,STARTNA!$A$12:$H$96,2,)","v":"LATINOVIĆ SRĐAN"},{"$f":"VLOOKUP(B13,STARTNA!$A$12:$H$96,3,)","v":"M"},{"$f":"VLOOKUP(B13,STARTNA!$A$12:$H$96,4,)","v":1988},{"$f":"VLOOKUP(B13,STARTNA!$A$12:$H$96,5,)","v":"M/Ž 39"},{"$f":"VLOOKUP(B13,STARTNA!$A$12:$H$96,6,)","v":"REKR"},{"$f":"VLOOKUP(B13,STARTNA!$A$12:$H$96,7,)","v":"SPLIT"},19.11,0,false,null,"10. Numerirati novi Rang"]
[3,29,{"$f":"VLOOKUP(B14,STARTNA!$A$12:$H$96,2,)","v":"STOJANOVIĆ MIHOVIL"},{"$f":"VLOOKUP(B14,STARTNA!$A$12:$H$96,3,)","v":"M"},{"$f":"VLOOKUP(B14,STARTNA!$A$12:$H$96,4,)","v":1985},{"$f":"VLOOKUP(B14,STARTNA!$A$12:$H$96,5,)","v":"M/Ž 49"},{"$f":"VLOOKUP(B14,STARTNA!$A$12:$H$96,6,)","v":"REKR"},{"$f":"VLOOKUP(B14,STARTNA!$A$12:$H$96,7,)","v":"DRNIŠ"},19.16,0,false,null,"11. Staviti zaštitu „h”"]
[4,39,{"$f":"VLOOKUP(B15,STARTNA!$A$12:$H$96,2,)","v":"BOBANOVIĆ NIKO"},{"$f":"VLOOKUP(B15,STARTNA!$A$12:$H$96,3,)","v":"M"},{"$f":"VLOOKUP(B15,STARTNA!$A$12:$H$96,4,)","v":2012},{"$f":"VLOOKUP(B15,STARTNA!$A$12:$H$96,5,)","v":"M/Ž 15"},{"$f":"VLOOKUP(B15,STARTNA!$A$12:$H$96,6,)","v":"REKR"},{"$f":"VLOOKUP(B15,STARTNA!$A$12:$H$96,7,)","v":"SPLIT"},20.03,0,false]
[5,31,{"$f":"VLOOKUP(B16,STARTNA!$A$12:$H$96,2,)","v":"GALIĆ PETRA"},"Ž",{"$f":"VLOOKUP(B16,STARTNA!$A$12:$H$96,4,)","v":2010},{"$f":"VLOOKUP(B16,STARTNA!$A$12:$H$96,5,)","v":"M/Ž 15"},{"$f":"VLOOKUP(B16,STARTNA!$A$12:$H$96,6,)","v":"REKR"},{"$f":"VLOOKUP(B16,STARTNA!$A$12:$H$96,7,)","v":"SPLIT"},20.16,0,false]
[6,23,{"$f":"VLOOKUP(B17,STARTNA!$A$12:$H$96,2,)","v":"KUNDID IGOR"},{"$f":"VLOOKUP(B17,STARTNA!$A$12:$H$96,3,)","v":"M"},{"$f":"VLOOKUP(B17,STARTNA!$A$12:$H$96,4,)","v":1981},{"$f":"VLOOKUP(B17,STARTNA!$A$12:$H$96,5,)","v":"M/Ž 49"},{"$f":"VLOOKUP(B17,STARTNA!$A$12:$H$96,6,)","v":"REKR"},{"$f":"VLOOKUP(B17,STARTNA!$A$12:$H$96,7,)","v":"STOBREČ"},20.34,0,false]
[7,44,{"$f":"VLOOKUP(B18,STARTNA!$A$12:$H$96,2,)","v":"GABELLINI DIEGO"},{"$f":"VLOOKUP(B18,STARTNA!$A$12:$H$96,3,)","v":"M"},{"$f":"VLOOKUP(B18,STARTNA!$A$12:$H$96,4,)","v":2013},{"$f":"VLOOKUP(B18,STARTNA!$A$12:$H$96,5,)","v":"M/Ž 12"},{"$f":"VLOOKUP(B18,STARTNA!$A$12:$H$96,6,)","v":"REKR"},{"$f":"VLOOKUP(B18,STARTNA!$A$12:$H$96,7,)","v":"ITALIJA"},20.45,0,false]
[8,28,{"$f":"VLOOKUP(B19,STARTNA!$A$12:$H$96,2,)","v":"ZEKANOVIĆ MIA"},{"$f":"VLOOKUP(B19,STARTNA!$A$12:$H$96,3,)","v":"Ž"},{"$f":"VLOOKUP(B19,STARTNA!$A$12:$H$96,4,)","v":2010},{"$f":"VLOOKUP(B19,STARTNA!$A$12:$H$96,5,)","v":"M/Ž 15"},{"$f":"VLOOKUP(B19,STARTNA!$A$12:$H$96,6,)","v":"REKR"},{"$f":"VLOOKUP(B19,STARTNA!$A$12:$H$96,7,)","v":"ZADAR"},20.58,0,false]
[9,33,{"$f":"VLOOKUP(B20,STARTNA!$A$12:$H$96,2,)","v":"BOŽAN LUKA"},{"$f":"VLOOKUP(B20,STARTNA!$A$12:$H$96,3,)","v":"M"},{"$f":"VLOOKUP(B20,STARTNA!$A$12:$H$96,4,)","v":2010},{"$f":"VLOOKUP(B20,STARTNA!$A$12:$H$96,5,)","v":"M/Ž 15"},{"$f":"VLOOKUP(B20,STARTNA!$A$12:$H$96,6,)","v":"REKR"},{"$f":"VLOOKUP(B20,STARTNA!$A$12:$H$96,7,)","v":"ZAGREB"},21,0,false]
[10,37,{"$f":"VLOOKUP(B21,STARTNA!$A$12:$H$96,2,)","v":"JAKOVČIĆ ROZA"},{"$f":"VLOOKUP(B21,STARTNA!$A$12:$H$96,3,)","v":"Ž"},{"$f":"VLOOKUP(B21,STARTNA!$A$12:$H$96,4,)","v":2012},{"$f":"VLOOKUP(B21,STARTNA!$A$12:$H$96,5,)","v":"M/Ž 15"},{"$f":"VLOOKUP(B21,STARTNA!$A$12:$H$96,6,)","v":"REKR"},{"$f":"VLOOKUP(B21,STARTNA!$A$12:$H$96,7,)","v":"OMIŠ"},21.02,"DOM",false]
[11,30,{"$f":"VLOOKUP(B22,STARTNA!$A$12:$H$96,2,)","v":"BRZOVIĆ ANA"},{"$f":"VLOOKUP(B22,STARTNA!$A$12:$H$96,3,)","v":"Ž"},{"$f":"VLOOKUP(B22,STARTNA!$A$12:$H$96,4,)","v":2008},{"$f":"VLOOKUP(B22,STARTNA!$A$12:$H$96,5,)","v":"M/Ž 19"},{"$f":"VLOOKUP(B22,STARTNA!$A$12:$H$96,6,)","v":"REKR"},{"$f":"VLOOKUP(B22,STARTNA!$A$12:$H$96,7,)","v":"OMIŠ"},21.13,"DOM",false]
[12,54,{"$f":"VLOOKUP(B23,STARTNA!$A$12:$H$96,2,)","v":"BEBIĆ MIJO"},{"$f":"VLOOKUP(B23,STARTNA!$A$12:$H$96,3,)","v":"M"},{"$f":"VLOOKUP(B23,STARTNA!$A$12:$H$96,4,)","v":1978},{"$f":"VLOOKUP(B23,STARTNA!$A$12:$H$96,5,)","v":"M/Ž 49"},{"$f":"VLOOKUP(B23,STARTNA!$A$12:$H$96,6,)","v":"REKR"},{"$f":"VLOOKUP(B23,STARTNA!$A$12:$H$96,7,)","v":"SPLIT"},21.17,0,false]
[13,1,{"$f":"VLOOKUP(B24,STARTNA!$A$12:$H$96,2,)","v":"PRVAN BORKO"},{"$f":"VLOOKUP(B24,STARTNA!$A$12:$H$96,3,)","v":"M"},{"$f":"VLOOKUP(B24,STARTNA!$A$12:$H$96,4,)","v":1951},{"$f":"VLOOKUP(B24,STARTNA!$A$12:$H$96,5,)","v":"M/Ž 75"},{"$f":"VLOOKUP(B24,STARTNA!$A$12:$H$96,6,)","v":"REKR"},{"$f":"VLOOKUP(B24,STARTNA!$A$12:$H$96,7,)","v":"ZAGREB"},21.51,0,false]
[14,49,{"$f":"VLOOKUP(B25,STARTNA!$A$12:$H$96,2,)","v":"PULIĆ JOŠKO"},{"$f":"VLOOKUP(B25,STARTNA!$A$12:$H$96,3,)","v":"M"},{"$f":"VLOOKUP(B25,STARTNA!$A$12:$H$96,4,)","v":1981},{"$f":"VLOOKUP(B25,STARTNA!$A$12:$H$96,5,)","v":"M/Ž 49"},{"$f":"VLOOKUP(B25,STARTNA!$A$12:$H$96,6,)","v":"REKR"},{"$f":"VLOOKUP(B25,STARTNA!$A$12:$H$96,7,)","v":"DUBROVNIK"},22.11,0,false]
[15,27,{"$f":"VLOOKUP(B26,STARTNA!$A$12:$H$96,2,)","v":"GRUBIŠIĆ DRAGAN"},{"$f":"VLOOKUP(B26,STARTNA!$A$12:$H$96,3,)","v":"M"},{"$f":"VLOOKUP(B26,STARTNA!$A$12:$H$96,4,)","v":1968},{"$f":"VLOOKUP(B26,STARTNA!$A$12:$H$96,5,)","v":"M/Ž 59"},{"$f":"VLOOKUP(B26,STARTNA!$A$12:$H$96,6,)","v":"REKR"},{"$f":"VLOOKUP(B26,STARTNA!$A$12:$H$96,7,)","v":"ŠIBENIK"},22.24,0,false]
[16,11,{"$f":"VLOOKUP(B27,STARTNA!$A$12:$H$96,2,)","v":"BRKOVIĆ MARIN"},{"$f":"VLOOKUP(B27,STARTNA!$A$12:$H$96,3,)","v":"M"},{"$f":"VLOOKUP(B27,STARTNA!$A$12:$H$96,4,)","v":2015},{"$f":"VLOOKUP(B27,STARTNA!$A$12:$H$96,5,)","v":"M/Ž 12"},{"$f":"VLOOKUP(B27,STARTNA!$A$12:$H$96,6,)","v":"KLUB "},{"$f":"VLOOKUP(B27,STARTNA!$A$12:$H$96,7,)","v":"SPLIT"},25.09,0,false]
[17,19,{"$f":"VLOOKUP(B28,STARTNA!$A$12:$H$96,2,)","v":"GRGAT MARIJO"},{"$f":"VLOOKUP(B28,STARTNA!$A$12:$H$96,3,)","v":"M"},{"$f":"VLOOKUP(B28,STARTNA!$A$12:$H$96,4,)","v":1974},{"$f":"VLOOKUP(B28,STARTNA!$A$12:$H$96,5,)","v":"M/Ž 59"},{"$f":"VLOOKUP(B28,STARTNA!$A$12:$H$96,6,)","v":"REKR"},{"$f":"VLOOKUP(B28,STARTNA!$A$12:$H$96,7,)","v":"DUGI RAT"},25.37,0,false]
[18,45,{"$f":"VLOOKUP(B29,STARTNA!$A$12:$H$96,2,)","v":"MANDUŠIĆ IGOR"},{"$f":"VLOOKUP(B29,STARTNA!$A$12:$H$96,3,)","v":"M"},{"$f":"VLOOKUP(B29,STARTNA!$A$12:$H$96,4,)","v":1974},{"$f":"VLOOKUP(B29,STARTNA!$A$12:$H$96,5,)","v":"M/Ž 59"},{"$f":"VLOOKUP(B29,STARTNA!$A$12:$H$96,6,)","v":"REKR"},{"$f":"VLOOKUP(B29,STARTNA!$A$12:$H$96,7,)","v":"TROGIR"},25.46,0,false]
[19,22,{"$f":"VLOOKUP(B30,STARTNA!$A$12:$H$96,2,)","v":"BALIĆ ANTE"},{"$f":"VLOOKUP(B30,STARTNA!$A$12:$H$96,3,)","v":"M"},{"$f":"VLOOKUP(B30,STARTNA!$A$12:$H$96,4,)","v":1981},{"$f":"VLOOKUP(B30,STARTNA!$A$12:$H$96,5,)","v":"M/Ž 49"},{"$f":"VLOOKUP(B30,STARTNA!$A$12:$H$96,6,)","v":"REKR"},{"$f":"VLOOKUP(B30,STARTNA!$A$12:$H$96,7,)","v":"ZAGREB"},25.5,0,false]
[20,38,{"$f":"VLOOKUP(B31,STARTNA!$A$12:$H$96,2,)","v":"BOBANOVIĆ PETAR"},{"$f":"VLOOKUP(B31,STARTNA!$A$12:$H$96,3,)","v":"M"},{"$f":"VLOOKUP(B31,STARTNA!$A$12:$H$96,4,)","v":2015},{"$f":"VLOOKUP(B31,STARTNA!$A$12:$H$96,5,)","v":"M/Ž 12"},{"$f":"VLOOKUP(B31,STARTNA!$A$12:$H$96,6,)","v":"REKR"},{"$f":"VLOOKUP(B31,STARTNA!$A$12:$H$96,7,)","v":"SPLIT"},26.09,0,false]
[21,40,{"$f":"VLOOKUP(B32,STARTNA!$A$12:$H$96,2,)","v":"BOBANOVIĆ HRVOJE"},{"$f":"VLOOKUP(B32,STARTNA!$A$12:$H$96,3,)","v":"M"},{"$f":"VLOOKUP(B32,STARTNA!$A$12:$H$96,4,)","v":1979},{"$f":"VLOOKUP(B32,STARTNA!$A$12:$H$96,5,)","v":"M/Ž 49"},{"$f":"VLOOKUP(B32,STARTNA!$A$12:$H$96,6,)","v":"REKR"},{"$f":"VLOOKUP(B32,STARTNA!$A$12:$H$96,7,)","v":"SPLIT"},26.12,0,false]
[22,24,{"$f":"VLOOKUP(B33,STARTNA!$A$12:$H$96,2,)","v":"KUNDID TONI"},{"$f":"VLOOKUP(B33,STARTNA!$A$12:$H$96,3,)","v":"M"},{"$f":"VLOOKUP(B33,STARTNA!$A$12:$H$96,4,)","v":2014},{"$f":"VLOOKUP(B33,STARTNA!$A$12:$H$96,5,)","v":"M/Ž 12"},{"$f":"VLOOKUP(B33,STARTNA!$A$12:$H$96,6,)","v":"REKR "},{"$f":"VLOOKUP(B33,STARTNA!$A$12:$H$96,7,)","v":"STOBREČ"},26.2,0,false]
[23,21,{"$f":"VLOOKUP(B34,STARTNA!$A$12:$H$96,2,)","v":"ARAPOVIĆ ANA"},{"$f":"VLOOKUP(B34,STARTNA!$A$12:$H$96,3,)","v":"Ž"},{"$f":"VLOOKUP(B34,STARTNA!$A$12:$H$96,4,)","v":1982},{"$f":"VLOOKUP(B34,STARTNA!$A$12:$H$96,5,)","v":"M/Ž 49"},{"$f":"VLOOKUP(B34,STARTNA!$A$12:$H$96,6,)","v":"REKR"},{"$f":"VLOOKUP(B34,STARTNA!$A$12:$H$96,7,)","v":"SPLIT"},26.3,0,false]
[24,16,{"$f":"VLOOKUP(B35,STARTNA!$A$12:$H$96,2,)","v":"BILANOVIĆ JURE"},{"$f":"VLOOKUP(B35,STARTNA!$A$12:$H$96,3,)","v":"M"},{"$f":"VLOOKUP(B35,STARTNA!$A$12:$H$96,4,)","v":1981},{"$f":"VLOOKUP(B35,STARTNA!$A$12:$H$96,5,)","v":"M/Ž 49"},{"$f":"VLOOKUP(B35,STARTNA!$A$12:$H$96,6,)","v":"REKR"},{"$f":"VLOOKUP(B35,STARTNA!$A$12:$H$96,7,)","v":"DUGI RAT"},26.53,0,false]
[25,47,{"$f":"VLOOKUP(B36,STARTNA!$A$12:$H$96,2,)","v":"ČAGALJ VICKO"},{"$f":"VLOOKUP(B36,STARTNA!$A$12:$H$96,3,)","v":"M"},{"$f":"VLOOKUP(B36,STARTNA!$A$12:$H$96,4,)","v":1993},{"$f":"VLOOKUP(B36,STARTNA!$A$12:$H$96,5,)","v":"M/Ž 39"},{"$f":"VLOOKUP(B36,STARTNA!$A$12:$H$96,6,)","v":"REKR"},{"$f":"VLOOKUP(B36,STARTNA!$A$12:$H$96,7,)","v":"ZAGREB"},27.2,0,false]
[26,35,{"$f":"VLOOKUP(B37,STARTNA!$A$12:$H$96,2,)","v":"ŠOŠIĆ MARKO"},{"$f":"VLOOKUP(B37,STARTNA!$A$12:$H$96,3,)","v":"M"},{"$f":"VLOOKUP(B37,STARTNA!$A$12:$H$96,4,)","v":1985},{"$f":"VLOOKUP(B37,STARTNA!$A$12:$H$96,5,)","v":"M/Ž 49"},{"$f":"VLOOKUP(B37,STARTNA!$A$12:$H$96,6,)","v":"REKR"},{"$f":"VLOOKUP(B37,STARTNA!$A$12:$H$96,7,)","v":"BRELA"},27.21,0,false]
[27,55,{"$f":"VLOOKUP(B38,STARTNA!$A$12:$H$96,2,)","v":"PIVČEVIĆ IVO"},{"$f":"VLOOKUP(B38,STARTNA!$A$12:$H$96,3,)","v":"M"},{"$f":"VLOOKUP(B38,STARTNA!$A$12:$H$96,4,)","v":1993},{"$f":"VLOOKUP(B38,STARTNA!$A$12:$H$96,5,)","v":"M/Ž 39"},{"$f":"VLOOKUP(B38,STARTNA!$A$12:$H$96,6,)","v":"REKR"},{"$f":"VLOOKUP(B38,STARTNA!$A$12:$H$96,7,)","v":"OMIŠ"},27.34,"DOM",false]
[28,18,{"$f":"VLOOKUP(B39,STARTNA!$A$12:$H$96,2,)","v":"TOMIĆ ZORAN"},{"$f":"VLOOKUP(B39,STARTNA!$A$12:$H$96,3,)","v":"M"},{"$f":"VLOOKUP(B39,STARTNA!$A$12:$H$96,4,)","v":1974},{"$f":"VLOOKUP(B39,STARTNA!$A$12:$H$96,5,)","v":"M/Ž 59"},{"$f":"VLOOKUP(B39,STARTNA!$A$12:$H$96,6,)","v":"REKR"},{"$f":"VLOOKUP(B39,STARTNA!$A$12:$H$96,7,)","v":"SPLIT"},27.38,0,false]
[29,9,{"$f":"VLOOKUP(B40,STARTNA!$A$12:$H$96,2,)","v":"KNEŽEVIĆ FILIP"},{"$f":"VLOOKUP(B40,STARTNA!$A$12:$H$96,3,)","v":"M"},{"$f":"VLOOKUP(B40,STARTNA!$A$12:$H$96,4,)","v":1995},{"$f":"VLOOKUP(B40,STARTNA!$A$12:$H$96,5,)","v":"M/Ž 39"},{"$f":"VLOOKUP(B40,STARTNA!$A$12:$H$96,6,)","v":"REKR"},{"$f":"VLOOKUP(B40,STARTNA!$A$12:$H$96,7,)","v":"ŠIBENIK"},27.45,0,false]
[30,52,{"$f":"VLOOKUP(B41,STARTNA!$A$12:$H$96,2,)","v":"STANIĆ CVITA"},{"$f":"VLOOKUP(B41,STARTNA!$A$12:$H$96,3,)","v":"Ž"},{"$f":"VLOOKUP(B41,STARTNA!$A$12:$H$96,4,)","v":2011},{"$f":"VLOOKUP(B41,STARTNA!$A$12:$H$96,5,)","v":"M/Ž 15"},{"$f":"VLOOKUP(B41,STARTNA!$A$12:$H$96,6,)","v":"REKR"},{"$f":"VLOOKUP(B41,STARTNA!$A$12:$H$96,7,)","v":"OMIŠ"},27.46,"DOM",false]
[31,7,{"$f":"VLOOKUP(B42,STARTNA!$A$12:$H$96,2,)","v":"KEKEZ ANTE"},{"$f":"VLOOKUP(B42,STARTNA!$A$12:$H$96,3,)","v":"M"},{"$f":"VLOOKUP(B42,STARTNA!$A$12:$H$96,4,)","v":1950},{"$f":"VLOOKUP(B42,STARTNA!$A$12:$H$96,5,)","v":"M/Ž 75"},{"$f":"VLOOKUP(B42,STARTNA!$A$12:$H$96,6,)","v":"REKR"},{"$f":"VLOOKUP(B42,STARTNA!$A$12:$H$96,7,)","v":"OMIŠ"},27.48,"DOM",false]
[32,50,{"$f":"VLOOKUP(B43,STARTNA!$A$12:$H$96,2,)","v":"PERAK MARIJA"},{"$f":"VLOOKUP(B43,STARTNA!$A$12:$H$96,3,)","v":"Ž"},{"$f":"VLOOKUP(B43,STARTNA!$A$12:$H$96,4,)","v":2012},{"$f":"VLOOKUP(B43,STARTNA!$A$12:$H$96,5,)","v":"M/Ž 15"},{"$f":"VLOOKUP(B43,STARTNA!$A$12:$H$96,6,)","v":"REKR"},{"$f":"VLOOKUP(B43,STARTNA!$A$12:$H$96,7,)","v":"OMIŠ"},27.51,"DOM",false]
[33,5,{"$f":"VLOOKUP(B44,STARTNA!$A$12:$H$96,2,)","v":"KAČIĆ ZORAN"},{"$f":"VLOOKUP(B44,STARTNA!$A$12:$H$96,3,)","v":"M"},{"$f":"VLOOKUP(B44,STARTNA!$A$12:$H$96,4,)","v":1950},{"$f":"VLOOKUP(B44,STARTNA!$A$12:$H$96,5,)","v":"M/Ž 75"},{"$f":"VLOOKUP(B44,STARTNA!$A$12:$H$96,6,)","v":"REKR"},{"$f":"VLOOKUP(B44,STARTNA!$A$12:$H$96,7,)","v":"SPLIT"},28.16,{"$f":"IF($H$12:$H$103=\"Omiš\",\"DOM\",)","v":0},{"$f":"AND(E44<2014,G44=\"KLUB\")","v":false}]
[34,43,{"$f":"VLOOKUP(B45,STARTNA!$A$12:$H$96,2,)","v":"BAŠIĆ VEDRAN"},{"$f":"VLOOKUP(B45,STARTNA!$A$12:$H$96,3,)","v":"M"},{"$f":"VLOOKUP(B45,STARTNA!$A$12:$H$96,4,)","v":1975},{"$f":"VLOOKUP(B45,STARTNA!$A$12:$H$96,5,)","v":"M/Ž 59"},{"$f":"VLOOKUP(B45,STARTNA!$A$12:$H$96,6,)","v":"REKR"},{"$f":"VLOOKUP(B45,STARTNA!$A$12:$H$96,7,)","v":"SPLIT"},28.24,0,false]
[35,53,{"$f":"VLOOKUP(B46,STARTNA!$A$12:$H$96,2,)","v":"STANIĆ LEA"},{"$f":"VLOOKUP(B46,STARTNA!$A$12:$H$96,3,)","v":"Ž"},{"$f":"VLOOKUP(B46,STARTNA!$A$12:$H$96,4,)","v":2012},{"$f":"VLOOKUP(B46,STARTNA!$A$12:$H$96,5,)","v":"M/Ž 15"},{"$f":"VLOOKUP(B46,STARTNA!$A$12:$H$96,6,)","v":"REKR"},{"$f":"VLOOKUP(B46,STARTNA!$A$12:$H$96,7,)","v":"OMIŠ"},29.05,"DOM",false]
[36,46,{"$f":"VLOOKUP(B47,STARTNA!$A$12:$H$96,2,)","v":"MEKINIĆ PETAR"},{"$f":"VLOOKUP(B47,STARTNA!$A$12:$H$96,3,)","v":"M"},{"$f":"VLOOKUP(B47,STARTNA!$A$12:$H$96,4,)","v":2006},{"$f":"VLOOKUP(B47,STARTNA!$A$12:$H$96,5,)","v":"M/Ž 19"},{"$f":"VLOOKUP(B47,STARTNA!$A$12:$H$96,6,)","v":"REKR"},{"$f":"VLOOKUP(B47,STARTNA!$A$12:$H$96,7,)","v":"OMIŠ"},29.27,"DOM",false]
[37,51,{"$f":"VLOOKUP(B48,STARTNA!$A$12:$H$96,2,)","v":"DRAGOŠEVIĆ ELA"},{"$f":"VLOOKUP(B48,STARTNA!$A$12:$H$96,3,)","v":"Ž"},{"$f":"VLOOKUP(B48,STARTNA!$A$12:$H$96,4,)","v":2012},{"$f":"VLOOKUP(B48,STARTNA!$A$12:$H$96,5,)","v":"M/Ž 15"},{"$f":"VLOOKUP(B48,STARTNA!$A$12:$H$96,6,)","v":"REKR"},{"$f":"VLOOKUP(B48,STARTNA!$A$12:$H$96,7,)","v":"OMIŠ"},29.34,"DOM",false]
[38,26,{"$f":"VLOOKUP(B49,STARTNA!$A$12:$H$96,2,)","v":"GRUBIŠIĆ INES"},{"$f":"VLOOKUP(B49,STARTNA!$A$12:$H$96,3,)","v":"Ž"},{"$f":"VLOOKUP(B49,STARTNA!$A$12:$H$96,4,)","v":1995},{"$f":"VLOOKUP(B49,STARTNA!$A$12:$H$96,5,)","v":"M/Ž 39"},{"$f":"VLOOKUP(B49,STARTNA!$A$12:$H$96,6,)","v":"REKR"},{"$f":"VLOOKUP(B49,STARTNA!$A$12:$H$96,7,)","v":"ZAGREB"},29.41,0,false]
[39,15,{"$f":"VLOOKUP(B50,STARTNA!$A$12:$H$96,2,)","v":"LIPNJAK TAMARA"},{"$f":"VLOOKUP(B50,STARTNA!$A$12:$H$96,3,)","v":"Ž"},{"$f":"VLOOKUP(B50,STARTNA!$A$12:$H$96,4,)","v":1992},{"$f":"VLOOKUP(B50,STARTNA!$A$12:$H$96,5,)","v":"M/Ž 39"},{"$f":"VLOOKUP(B50,STARTNA!$A$12:$H$96,6,)","v":"REKR"},{"$f":"VLOOKUP(B50,STARTNA!$A$12:$H$96,7,)","v":"ZAGREB"},31.19,0,false]
[40,6,{"$f":"VLOOKUP(B51,STARTNA!$A$12:$H$96,2,)","v":"KAČIĆ DUPLANČIĆ DIANA"},{"$f":"VLOOKUP(B51,STARTNA!$A$12:$H$96,3,)","v":"Ž"},{"$f":"VLOOKUP(B51,STARTNA!$A$12:$H$96,4,)","v":1978},{"$f":"VLOOKUP(B51,STARTNA!$A$12:$H$96,5,)","v":"M/Ž 49"},{"$f":"VLOOKUP(B51,STARTNA!$A$12:$H$96,6,)","v":"REKR"},{"$f":"VLOOKUP(B51,STARTNA!$A$12:$H$96,7,)","v":"SPLIT"},31.33,0,false]
[41,42,{"$f":"VLOOKUP(B52,STARTNA!$A$12:$H$96,2,)","v":"BOBAN HRVOJE"},{"$f":"VLOOKUP(B52,STARTNA!$A$12:$H$96,3,)","v":"M"},{"$f":"VLOOKUP(B52,STARTNA!$A$12:$H$96,4,)","v":1976},{"$f":"VLOOKUP(B52,STARTNA!$A$12:$H$96,5,)","v":"M/Ž 49"},{"$f":"VLOOKUP(B52,STARTNA!$A$12:$H$96,6,)","v":"REKR"},{"$f":"VLOOKUP(B52,STARTNA!$A$12:$H$96,7,)","v":"SPLIT"},31.47,0,false]
[42,8,{"$f":"VLOOKUP(B53,STARTNA!$A$12:$H$96,2,)","v":"VERINA MARIA "},{"$f":"VLOOKUP(B53,STARTNA!$A$12:$H$96,3,)","v":"Ž"},{"$f":"VLOOKUP(B53,STARTNA!$A$12:$H$96,4,)","v":1965},{"$f":"VLOOKUP(B53,STARTNA!$A$12:$H$96,5,)","v":"M/Ž 65"},{"$f":"VLOOKUP(B53,STARTNA!$A$12:$H$96,6,)","v":"REKR"},{"$f":"VLOOKUP(B53,STARTNA!$A$12:$H$96,7,)","v":"SUTIVAN"},32.020000000000003,0,false]
[43,20,{"$f":"VLOOKUP(B54,STARTNA!$A$12:$H$96,2,)","v":"LUKIĆ ZITA"},{"$f":"VLOOKUP(B54,STARTNA!$A$12:$H$96,3,)","v":"Ž"},{"$f":"VLOOKUP(B54,STARTNA!$A$12:$H$96,4,)","v":2002},{"$f":"VLOOKUP(B54,STARTNA!$A$12:$H$96,5,)","v":"M/Ž 29"},{"$f":"VLOOKUP(B54,STARTNA!$A$12:$H$96,6,)","v":"REKR"},{"$f":"VLOOKUP(B54,STARTNA!$A$12:$H$96,7,)","v":"SPLIT"},32.119999999999997,0,false]
[44,36,{"$f":"VLOOKUP(B55,STARTNA!$A$12:$H$96,2,)","v":"JAKOVČIĆ FABJANA"},{"$f":"VLOOKUP(B55,STARTNA!$A$12:$H$96,3,)","v":"Ž"},{"$f":"VLOOKUP(B55,STARTNA!$A$12:$H$96,4,)","v":1975},{"$f":"VLOOKUP(B55,STARTNA!$A$12:$H$96,5,)","v":"M/Ž 59"},{"$f":"VLOOKUP(B55,STARTNA!$A$12:$H$96,6,)","v":"REKR"},{"$f":"VLOOKUP(B55,STARTNA!$A$12:$H$96,7,)","v":"OMIŠ"},32.25,"DOM",false]
[45,4,{"$f":"VLOOKUP(B56,STARTNA!$A$12:$H$96,2,)","v":"ĆOSIĆ HRVOJE"},{"$f":"VLOOKUP(B56,STARTNA!$A$12:$H$96,3,)","v":"M"},{"$f":"VLOOKUP(B56,STARTNA!$A$12:$H$96,4,)","v":1959},{"$f":"VLOOKUP(B56,STARTNA!$A$12:$H$96,5,)","v":"M/Ž 70"},{"$f":"VLOOKUP(B56,STARTNA!$A$12:$H$96,6,)","v":"REKR"},{"$f":"VLOOKUP(B56,STARTNA!$A$12:$H$96,7,)","v":"BIH"},34.07,0,false]
[46,12,{"$f":"VLOOKUP(B57,STARTNA!$A$12:$H$96,2,)","v":"DUMANIĆ NAĐAN"},{"$f":"VLOOKUP(B57,STARTNA!$A$12:$H$96,3,)","v":"M"},{"$f":"VLOOKUP(B57,STARTNA!$A$12:$H$96,4,)","v":1962},{"$f":"VLOOKUP(B57,STARTNA!$A$12:$H$96,5,)","v":"M/Ž 65"},{"$f":"VLOOKUP(B57,STARTNA!$A$12:$H$96,6,)","v":"REKR"},{"$f":"VLOOKUP(B57,STARTNA!$A$12:$H$96,7,)","v":"SPLIT"},34.11,0,false]
[47,14,{"$f":"VLOOKUP(B58,STARTNA!$A$12:$H$96,2,)","v":"ŠUŠNJAR PJERA"},{"$f":"VLOOKUP(B58,STARTNA!$A$12:$H$96,3,)","v":"Ž"},{"$f":"VLOOKUP(B58,STARTNA!$A$12:$H$96,4,)","v":1967},{"$f":"VLOOKUP(B58,STARTNA!$A$12:$H$96,5,)","v":"M/Ž 59"},{"$f":"VLOOKUP(B58,STARTNA!$A$12:$H$96,6,)","v":"REKR"},{"$f":"VLOOKUP(B58,STARTNA!$A$12:$H$96,7,)","v":"SPLIT"},34.450000000000003,0,false]
[48,57,{"$f":"VLOOKUP(B59,STARTNA!$A$12:$H$96,2,)","v":"ŠILJEG FILIPA"},{"$f":"VLOOKUP(B59,STARTNA!$A$12:$H$96,3,)","v":"Ž"},{"$f":"VLOOKUP(B59,STARTNA!$A$12:$H$96,4,)","v":2002},{"$f":"VLOOKUP(B59,STARTNA!$A$12:$H$96,5,)","v":"M/Ž 29"},{"$f":"VLOOKUP(B59,STARTNA!$A$12:$H$96,6,)","v":"REKR"},{"$f":"VLOOKUP(B59,STARTNA!$A$12:$H$96,7,)","v":"SPLIT"},34.520000000000003,0,false]
[49,3,{"$f":"VLOOKUP(B60,STARTNA!$A$12:$H$96,2,)","v":"ŠKORIĆ JOSIP"},{"$f":"VLOOKUP(B60,STARTNA!$A$12:$H$96,3,)","v":"M"},{"$f":"VLOOKUP(B60,STARTNA!$A$12:$H$96,4,)","v":1960},{"$f":"VLOOKUP(B60,STARTNA!$A$12:$H$96,5,)","v":"M/Ž 65"},{"$f":"VLOOKUP(B60,STARTNA!$A$12:$H$96,6,)","v":"REKR"},{"$f":"VLOOKUP(B60,STARTNA!$A$12:$H$96,7,)","v":"BIH"},35.04,0,false]
[50,48,{"$f":"VLOOKUP(B61,STARTNA!$A$12:$H$96,2,)","v":"TOMAŠ RADOSLAV"},{"$f":"VLOOKUP(B61,STARTNA!$A$12:$H$96,3,)","v":"M"},{"$f":"VLOOKUP(B61,STARTNA!$A$12:$H$96,4,)","v":1951},{"$f":"VLOOKUP(B61,STARTNA!$A$12:$H$96,5,)","v":"M/Ž 75"},{"$f":"VLOOKUP(B61,STARTNA!$A$12:$H$96,6,)","v":"REKR"},{"$f":"VLOOKUP(B61,STARTNA!$A$12:$H$96,7,)","v":"ZAGREB"},36.07,0,false]
[51,13,{"$f":"VLOOKUP(B62,STARTNA!$A$12:$H$96,2,)","v":"ŠUŠNJAR MARIN"},{"$f":"VLOOKUP(B62,STARTNA!$A$12:$H$96,3,)","v":"M"},{"$f":"VLOOKUP(B62,STARTNA!$A$12:$H$96,4,)","v":1961},{"$f":"VLOOKUP(B62,STARTNA!$A$12:$H$96,5,)","v":"M/Ž 65"},{"$f":"VLOOKUP(B62,STARTNA!$A$12:$H$96,6,)","v":"REKR"},{"$f":"VLOOKUP(B62,STARTNA!$A$12:$H$96,7,)","v":"SPLIT"},37.29,0,false]
[52,41,{"$f":"VLOOKUP(B63,STARTNA!$A$12:$H$96,2,)","v":"PERICA ŠINKA"},{"$f":"VLOOKUP(B63,STARTNA!$A$12:$H$96,3,)","v":"Ž"},{"$f":"VLOOKUP(B63,STARTNA!$A$12:$H$96,4,)","v":1966},{"$f":"VLOOKUP(B63,STARTNA!$A$12:$H$96,5,)","v":"M/Ž 59"},{"$f":"VLOOKUP(B63,STARTNA!$A$12:$H$96,6,)","v":"REKR"},{"$f":"VLOOKUP(B63,STARTNA!$A$12:$H$96,7,)","v":"OMIŠ"},39.44,"DOM",false]
[53,56,{"$f":"VLOOKUP(B64,STARTNA!$A$12:$H$96,2,)","v":"MIMICA MIROSLAV"},{"$f":"VLOOKUP(B64,STARTNA!$A$12:$H$96,3,)","v":"M"},{"$f":"VLOOKUP(B64,STARTNA!$A$12:$H$96,4,)","v":1958},{"$f":"VLOOKUP(B64,STARTNA!$A$12:$H$96,5,)","v":"M/Ž 70"},{"$f":"VLOOKUP(B64,STARTNA!$A$12:$H$96,6,)","v":"REKR"},{"$f":"VLOOKUP(B64,STARTNA!$A$12:$H$96,7,)","v":"DUGI RAT"},40.369999999999997,0,false]
[]
[]
[]
[null,null,"plivači IZVAN KONKURENCIJE"]
[]
["RANG","ST. BR","PREZIME I IME","S","GOD","KAT","MJESTO","REK / KL","REZ","DOM","IK"]
[2,25,"BRATIĆ DAMIR","M",2012,{"$f":"IF(E71>2012,\"M/Ž 12\",IF(E71>2009,\"M/Ž 15\",IF(E71>2005,\"M/Ž 19\",IF(E71>1995,\"M/Ž 29\",IF(E71>1985,\"M/Ž 39\",IF(E71>1975,\"M/Ž 49\",IF(E71>1965,\"M/Ž 59\",IF(E71>1959,\"M/Ž 65\",IF(E71>1954,\"M/Ž 70\",IF(E71>1949,\"M/Ž 75\",IF(E71>1931,\"M/Ž 75+\",)))))))))))","v":"M/Ž 15"},"KLUB","SPLIT",18.489999999999998,{"$f":"IF($H$12:$H$103=\"Omiš\",\"DOM\",)","v":0},1]
[9,2,{"$f":"VLOOKUP(B72,STARTNA!$A$12:$H$96,2,)","v":"VIDEKOVIĆ UNA"},{"$f":"VLOOKUP(B72,STARTNA!$A$12:$H$96,3,)","v":"Ž"},{"$f":"VLOOKUP(B72,STARTNA!$A$12:$H$96,4,)","v":2011},{"$f":"VLOOKUP(B72,STARTNA!$A$12:$H$96,5,)","v":"M/Ž 15"},{"$f":"VLOOKUP(B72,STARTNA!$A$12:$H$96,6,)","v":"KLUB "},{"$f":"VLOOKUP(B72,STARTNA!$A$12:$H$96,7,)","v":"VINKOVCI"},20.51,{"$f":"IF($H$12:$H$103=\"Omiš\",\"DOM\",)","v":0},1]
[12,10,{"$f":"VLOOKUP(B73,STARTNA!$A$12:$H$96,2,)","v":"RADNIĆ GEA"},{"$f":"VLOOKUP(B73,STARTNA!$A$12:$H$96,3,)","v":"Ž"},{"$f":"VLOOKUP(B73,STARTNA!$A$12:$H$96,4,)","v":2013},{"$f":"VLOOKUP(B73,STARTNA!$A$12:$H$96,5,)","v":"M/Ž 12"},{"$f":"VLOOKUP(B73,STARTNA!$A$12:$H$96,6,)","v":"KLUB "},{"$f":"VLOOKUP(B73,STARTNA!$A$12:$H$96,7,)","v":"SPLIT"},21.08,{"$f":"IF($H$12:$H$103=\"Omiš\",\"DOM\",)","v":0},1]
[46,17,{"$f":"VLOOKUP(B74,STARTNA!$A$12:$H$96,2,)","v":"BELOUSOVA MARIA"},{"$f":"VLOOKUP(B74,STARTNA!$A$12:$H$96,3,)","v":"Ž"},{"$f":"VLOOKUP(B74,STARTNA!$A$12:$H$96,4,)","v":2012},{"$f":"VLOOKUP(B74,STARTNA!$A$12:$H$96,5,)","v":"M/Ž 15"},{"$f":"VLOOKUP(B74,STARTNA!$A$12:$H$96,6,)","v":"KLUB "},{"$f":"VLOOKUP(B74,STARTNA!$A$12:$H$96,7,)","v":"BRASINA"},32.090000000000003,{"$f":"IF($H$12:$H$103=\"Omiš\",\"DOM\",)","v":0},1]
[]
[]
[" "]

{"sheet":"POBJEDNICI","index":3,"n_rows":52,"n_cols":11,"rows_kept":52,"cut":false,"hidden":false,"merged":[[4,0,4,9],[4,13,4,16],[7,13,7,16],[51,0,56,8]]}
[]
[]
[]
[]
["299 OTVORENO PRVENSTVO DALMACIJE U DALJINSKOM PLIVANJU - OMIŠ 2022."]
[]
[null,"dionica - 1501 metar",null,null,null,"Omiš, 20. 8. 2022."]
[]
[null,null,"POBJEDNICI"]
[]
[null,null,"UKUPNO MUŠKI"]
["rang","ST. BR","PREZIME I IME","S","GOD","KAT","klub/rekr","MJESTO","rez","DOM","IK"]
[1,32,{"$f":"VLOOKUP(B13,STARTNA!$A$12:$H$96,2,)","v":"TAFRA MATE"},{"$f":"VLOOKUP(B13,STARTNA!$A$12:$H$96,3,)","v":"M"},{"$f":"VLOOKUP(B13,STARTNA!$A$12:$H$96,4,)","v":2009},{"$f":"VLOOKUP(B13,STARTNA!$A$12:$H$96,5,)","v":"M/Ž 19"},{"$f":"VLOOKUP(B13,STARTNA!$A$12:$H$96,6,)","v":"REKR"},{"$f":"VLOOKUP(B13,STARTNA!$A$12:$H$96,7,)","v":"OMIŠ"},18.11,{"$f":"IF($H$12:$H$161=\"Omiš\",\"DOM\",)","v":"DOM"},0]
[2,34,{"$f":"VLOOKUP(B14,STARTNA!$A$12:$H$96,2,)","v":"LATINOVIĆ SRĐAN"},{"$f":"VLOOKUP(B14,STARTNA!$A$12:$H$96,3,)","v":"M"},{"$f":"VLOOKUP(B14,STARTNA!$A$12:$H$96,4,)","v":1988},{"$f":"VLOOKUP(B14,STARTNA!$A$12:$H$96,5,)","v":"M/Ž 39"},{"$f":"VLOOKUP(B14,STARTNA!$A$12:$H$96,6,)","v":"REKR"},{"$f":"VLOOKUP(B14,STARTNA!$A$12:$H$96,7,)","v":"SPLIT"},19.11,{"$f":"IF($H$12:$H$161=\"Omiš\",\"DOM\",)","v":0},{"$f":"AND(E14<2014,G14=\"KLUB\")","v":false}]
[3,29,{"$f":"VLOOKUP(B15,STARTNA!$A$12:$H$96,2,)","v":"STOJANOVIĆ MIHOVIL"},{"$f":"VLOOKUP(B15,STARTNA!$A$12:$H$96,3,)","v":"M"},{"$f":"VLOOKUP(B15,STARTNA!$A$12:$H$96,4,)","v":1985},{"$f":"VLOOKUP(B15,STARTNA!$A$12:$H$96,5,)","v":"M/Ž 49"},{"$f":"VLOOKUP(B15,STARTNA!$A$12:$H$96,6,)","v":"REKR"},{"$f":"VLOOKUP(B15,STARTNA!$A$12:$H$96,7,)","v":"DRNIŠ"},19.16,{"$f":"IF($H$12:$H$104=\"Omiš\",\"DOM\",)","v":0},{"$f":"AND(E15<2014,G15=\"KLUB\")","v":false}]
[]
[null,null,"UKUPNO ŽENSKE"]
["rang","ST. BR","PREZIME I IME","S","GOD","KAT","klub/rekr","MJESTO","rez","DOM","IK"]
[1,31,{"$f":"VLOOKUP(B19,STARTNA!$A$12:$H$96,2,)","v":"GALIĆ PETRA"},"Ž",{"$f":"VLOOKUP(B19,STARTNA!$A$12:$H$96,4,)","v":2010},{"$f":"VLOOKUP(B19,STARTNA!$A$12:$H$96,5,)","v":"M/Ž 15"},{"$f":"VLOOKUP(B19,STARTNA!$A$12:$H$96,6,)","v":"REKR"},{"$f":"VLOOKUP(B19,STARTNA!$A$12:$H$96,7,)","v":"SPLIT"},20.16,{"$f":"IF($H$12:$H$161=\"Omiš\",\"DOM\",)","v":0},{"$f":"AND(E19<2014,G19=\"KLUB\")","v":false}]
[2,28,{"$f":"VLOOKUP(B20,STARTNA!$A$12:$H$96,2,)","v":"ZEKANOVIĆ MIA"},{"$f":"VLOOKUP(B20,STARTNA!$A$12:$H$96,3,)","v":"Ž"},{"$f":"VLOOKUP(B20,STARTNA!$A$12:$H$96,4,)","v":2010},{"$f":"VLOOKUP(B20,STARTNA!$A$12:$H$96,5,)","v":"M/Ž 15"},{"$f":"VLOOKUP(B20,STARTNA!$A$12:$H$96,6,)","v":"REKR"},{"$f":"VLOOKUP(B20,STARTNA!$A$12:$H$96,7,)","v":"ZADAR"},20.58,{"$f":"IF($H$12:$H$161=\"Omiš\",\"DOM\",)","v":0},{"$f":"AND(E20<2014,G20=\"KLUB\")","v":false}]
[3,37,{"$f":"VLOOKUP(B21,STARTNA!$A$12:$H$96,2,)","v":"JAKOVČIĆ ROZA"},{"$f":"VLOOKUP(B21,STARTNA!$A$12:$H$96,3,)","v":"Ž"},{"$f":"VLOOKUP(B21,STARTNA!$A$12:$H$96,4,)","v":2012},{"$f":"VLOOKUP(B21,STARTNA!$A$12:$H$96,5,)","v":"M/Ž 15"},{"$f":"VLOOKUP(B21,STARTNA!$A$12:$H$96,6,)","v":"REKR"},{"$f":"VLOOKUP(B21,STARTNA!$A$12:$H$96,7,)","v":"OMIŠ"},21.02,{"$f":"IF($H$12:$H$161=\"Omiš\",\"DOM\",)","v":"DOM"},{"$f":"AND(E21<2014,G21=\"KLUB\")","v":false}]
[]
[null,null,"DOMAĆI PLIVAČI MUŠKI"]
["rang","ST. BR","PREZIME I IME","S","GOD","KAT","klub/rekr","MJESTO","rez","DOM","IK"]
[1,32,{"$f":"VLOOKUP(B25,STARTNA!$A$12:$H$96,2,)","v":"TAFRA MATE"},{"$f":"VLOOKUP(B25,STARTNA!$A$12:$H$96,3,)","v":"M"},{"$f":"VLOOKUP(B25,STARTNA!$A$12:$H$96,4,)","v":2009},{"$f":"VLOOKUP(B25,STARTNA!$A$12:$H$96,5,)","v":"M/Ž 19"},{"$f":"VLOOKUP(B25,STARTNA!$A$12:$H$96,6,)","v":"REKR"},{"$f":"VLOOKUP(B25,STARTNA!$A$12:$H$96,7,)","v":"OMIŠ"},18.11,{"$f":"IF($H$12:$H$161=\"Omiš\",\"DOM\",)","v":"DOM"},0]
[2,55,{"$f":"VLOOKUP(B26,STARTNA!$A$12:$H$96,2,)","v":"PIVČEVIĆ IVO"},{"$f":"VLOOKUP(B26,STARTNA!$A$12:$H$96,3,)","v":"M"},{"$f":"VLOOKUP(B26,STARTNA!$A$12:$H$96,4,)","v":1993},{"$f":"VLOOKUP(B26,STARTNA!$A$12:$H$96,5,)","v":"M/Ž 39"},{"$f":"VLOOKUP(B26,STARTNA!$A$12:$H$96,6,)","v":"REKR"},{"$f":"VLOOKUP(B26,STARTNA!$A$12:$H$96,7,)","v":"OMIŠ"},27.34,{"$f":"IF($H$12:$H$161=\"Omiš\",\"DOM\",)","v":"DOM"},{"$f":"AND(E26<2014,G26=\"KLUB\")","v":false}]
[3,7,{"$f":"VLOOKUP(B27,STARTNA!$A$12:$H$96,2,)","v":"KEKEZ ANTE"},{"$f":"VLOOKUP(B27,STARTNA!$A$12:$H$96,3,)","v":"M"},{"$f":"VLOOKUP(B27,STARTNA!$A$12:$H$96,4,)","v":1950},{"$f":"VLOOKUP(B27,STARTNA!$A$12:$H$96,5,)","v":"M/Ž 75"},{"$f":"VLOOKUP(B27,STARTNA!$A$12:$H$96,6,)","v":"REKR"},{"$f":"VLOOKUP(B27,STARTNA!$A$12:$H$96,7,)","v":"OMIŠ"},27.48,{"$f":"IF($H$12:$H$161=\"Omiš\",\"DOM\",)","v":"DOM"},{"$f":"AND(E27<2014,G27=\"KLUB\")","v":false}]
[]
[null,null,"DOMAĆE PLIVAČICE ŽENSKE"]
["rang","ST. BR","PREZIME I IME","S","GOD","KAT","klub/rekr","MJESTO",null,"DOM","IK"]
[1,37,{"$f":"VLOOKUP(B31,STARTNA!$A$12:$H$96,2,)","v":"JAKOVČIĆ ROZA"},{"$f":"VLOOKUP(B31,STARTNA!$A$12:$H$96,3,)","v":"Ž"},{"$f":"VLOOKUP(B31,STARTNA!$A$12:$H$96,4,)","v":2012},{"$f":"VLOOKUP(B31,STARTNA!$A$12:$H$96,5,)","v":"M/Ž 15"},{"$f":"VLOOKUP(B31,STARTNA!$A$12:$H$96,6,)","v":"REKR"},{"$f":"VLOOKUP(B31,STARTNA!$A$12:$H$96,7,)","v":"OMIŠ"},21.02,{"$f":"IF($H$12:$H$161=\"Omiš\",\"DOM\",)","v":"DOM"},{"$f":"AND(E31<2014,G31=\"KLUB\")","v":false}]
[2,30,{"$f":"VLOOKUP(B32,STARTNA!$A$12:$H$96,2,)","v":"BRZOVIĆ ANA"},{"$f":"VLOOKUP(B32,STARTNA!$A$12:$H$96,3,)","v":"Ž"},{"$f":"VLOOKUP(B32,STARTNA!$A$12:$H$96,4,)","v":2008},{"$f":"VLOOKUP(B32,STARTNA!$A$12:$H$96,5,)","v":"M/Ž 19"},{"$f":"VLOOKUP(B32,STARTNA!$A$12:$H$96,6,)","v":"REKR"},{"$f":"VLOOKUP(B32,STARTNA!$A$12:$H$96,7,)","v":"OMIŠ"},21.13,{"$f":"IF($H$12:$H$161=\"Omiš\",\"DOM\",)","v":"DOM"},{"$f":"AND(E32<2014,G32=\"KLUB\")","v":false}]
[3,52,{"$f":"VLOOKUP(B33,STARTNA!$A$12:$H$96,2,)","v":"STANIĆ CVITA"},{"$f":"VLOOKUP(B33,STARTNA!$A$12:$H$96,3,)","v":"Ž"},{"$f":"VLOOKUP(B33,STARTNA!$A$12:$H$96,4,)","v":2011},{"$f":"VLOOKUP(B33,STARTNA!$A$12:$H$96,5,)","v":"M/Ž 15"},{"$f":"VLOOKUP(B33,STARTNA!$A$12:$H$96,6,)","v":"REKR"},{"$f":"VLOOKUP(B33,STARTNA!$A$12:$H$96,7,)","v":"OMIŠ"},27.46,{"$f":"IF($H$12:$H$161=\"Omiš\",\"DOM\",)","v":"DOM"},{"$f":"AND(E33<2014,G33=\"KLUB\")","v":false}]
[]
[null,null,"NAJMLAĐI PLIVAČ"]
["rang","ST. BR","PREZIME I IME","S","GOD","KAT","klub/rekr","MJESTO","rez","DOM","IK"]
[17,11,{"$f":"VLOOKUP(B37,STARTNA!$A$12:$H$96,2,)","v":"BRKOVIĆ MARIN"},{"$f":"VLOOKUP(B37,STARTNA!$A$12:$H$96,3,)","v":"M"},{"$f":"VLOOKUP(B37,STARTNA!$A$12:$H$96,4,)","v":2015},{"$f":"VLOOKUP(B37,STARTNA!$A$12:$H$96,5,)","v":"M/Ž 12"},{"$f":"VLOOKUP(B37,STARTNA!$A$12:$H$96,6,)","v":"KLUB "},{"$f":"VLOOKUP(B37,STARTNA!$A$12:$H$96,7,)","v":"SPLIT"},25.09]
[]
[null,null,"NAJMLAĐA PLIVAČICA"]
["rang","ST. BR","PREZIME I IME","S","GOD","KAT","klub/rekr","MJESTO","rez","DOM","IK"]
[12,10,{"$f":"VLOOKUP(B41,STARTNA!$A$12:$H$96,2,)","v":"RADNIĆ GEA"},{"$f":"VLOOKUP(B41,STARTNA!$A$12:$H$96,3,)","v":"Ž"},{"$f":"VLOOKUP(B41,STARTNA!$A$12:$H$96,4,)","v":2013},{"$f":"VLOOKUP(B41,STARTNA!$A$12:$H$96,5,)","v":"M/Ž 12"},{"$f":"VLOOKUP(B41,STARTNA!$A$12:$H$96,6,)","v":"KLUB "},{"$f":"VLOOKUP(B41,STARTNA!$A$12:$H$96,7,)","v":"SPLIT"},21.08]
[]
[null,null,"NAJSTARIJI PLIVAČ"]
["rang","ST. BR","PREZIME I IME","S","GOD","KAT","klub/rekr","MJESTO","rez","DOM","IK"]
[34,5,{"$f":"VLOOKUP(B45,STARTNA!$A$12:$H$96,2,)","v":"KAČIĆ ZORAN"},{"$f":"VLOOKUP(B45,STARTNA!$A$12:$H$96,3,)","v":"M"},{"$f":"VLOOKUP(B45,STARTNA!$A$12:$H$96,4,)","v":1950},{"$f":"VLOOKUP(B45,STARTNA!$A$12:$H$96,5,)","v":"M/Ž 75"},{"$f":"VLOOKUP(B45,STARTNA!$A$12:$H$96,6,)","v":"REKR"},{"$f":"VLOOKUP(B45,STARTNA!$A$12:$H$96,7,)","v":"SPLIT"},28.16]
[]
[null,null,"NAJSTARIJA PLIVAČICA"]
["rang","ST. BR","PREZIME I IME","S","GOD",null,"MJESTO","REK / KL","rez","DOM","IK"]
[43,8,{"$f":"VLOOKUP(B49,STARTNA!$A$12:$H$96,2,)","v":"VERINA MARIA "},{"$f":"VLOOKUP(B49,STARTNA!$A$12:$H$96,3,)","v":"Ž"},{"$f":"VLOOKUP(B49,STARTNA!$A$12:$H$96,4,)","v":1965},{"$f":"VLOOKUP(B49,STARTNA!$A$12:$H$96,5,)","v":"M/Ž 65"},{"$f":"VLOOKUP(B49,STARTNA!$A$12:$H$96,6,)","v":"REKR"},{"$f":"VLOOKUP(B49,STARTNA!$A$12:$H$96,7,)","v":"SUTIVAN"},32.020000000000003]
[]
[]
[" "]

{"sheet":"KATEGORIJE","index":4,"n_rows":124,"n_cols":11,"rows_kept":124,"cut":false,"hidden":false,"merged":[[4,0,4,9],[4,13,4,16],[7,13,7,16],[123,0,128,8]]}
[]
[]
[]
[]
["299 OTVORENO PRVENSTVO DALMACIJE U DALJINSKOM PLIVANJU - OMIŠ 2022."]
[]
[null,"dionica - 1501 metar",null,null,null,"Omiš, 20. 8. 2022."]
[]
[null,null,"KATEGORIJE"]
[]
[]
[null,null,"M12"]
["rang","ST. BR","PREZIME I IME","S","GOD","KAT","klub/rekr","MJESTO","rez","DOM","IK"]
[1,44,{"$f":"VLOOKUP(B14,STARTNA!$A$12:$H$96,2,)","v":"GABELLINI DIEGO"},{"$f":"VLOOKUP(B14,STARTNA!$A$12:$H$96,3,)","v":"M"},{"$f":"VLOOKUP(B14,STARTNA!$A$12:$H$96,4,)","v":2013},{"$f":"VLOOKUP(B14,STARTNA!$A$12:$H$96,5,)","v":"M/Ž 12"},{"$f":"VLOOKUP(B14,STARTNA!$A$12:$H$96,6,)","v":"REKR"},{"$f":"VLOOKUP(B14,STARTNA!$A$12:$H$96,7,)","v":"ITALIJA"},20.45,{"$f":"IF($H$12:$H$138=\"Omiš\",\"DOM\",)","v":0},{"$f":"AND(E14<2014,G14=\"KLUB\")","v":false}]
[2,11,{"$f":"VLOOKUP(B15,STARTNA!$A$12:$H$96,2,)","v":"BRKOVIĆ MARIN"},{"$f":"VLOOKUP(B15,STARTNA!$A$12:$H$96,3,)","v":"M"},{"$f":"VLOOKUP(B15,STARTNA!$A$12:$H$96,4,)","v":2015},{"$f":"VLOOKUP(B15,STARTNA!$A$12:$H$96,5,)","v":"M/Ž 12"},{"$f":"VLOOKUP(B15,STARTNA!$A$12:$H$96,6,)","v":"KLUB "},{"$f":"VLOOKUP(B15,STARTNA!$A$12:$H$96,7,)","v":"SPLIT"},25.09,{"$f":"IF($H$12:$H$138=\"Omiš\",\"DOM\",)","v":0},{"$f":"AND(E15<2014,G15=\"KLUB\")","v":false}]
[3,38,{"$f":"VLOOKUP(B16,STARTNA!$A$12:$H$96,2,)","v":"BOBANOVIĆ PETAR"},{"$f":"VLOOKUP(B16,STARTNA!$A$12:$H$96,3,)","v":"M"},{"$f":"VLOOKUP(B16,STARTNA!$A$12:$H$96,4,)","v":2015},{"$f":"VLOOKUP(B16,STARTNA!$A$12:$H$96,5,)","v":"M/Ž 12"},{"$f":"VLOOKUP(B16,STARTNA!$A$12:$H$96,6,)","v":"REKR"},{"$f":"VLOOKUP(B16,STARTNA!$A$12:$H$96,7,)","v":"SPLIT"},26.09,{"$f":"IF($H$12:$H$138=\"Omiš\",\"DOM\",)","v":0},{"$f":"AND(E16<2014,G16=\"KLUB\")","v":false}]
[]
[null,null,"Ž12"]
["rang","ST. BR","PREZIME I IME","S","GOD","KAT","klub/rekr","MJESTO","rez","DOM","IK"]
[1]
[]
[null,null,"M15"]
["rang","ST. BR","PREZIME I IME","S","GOD","KAT","klub/rekr","MJESTO","rez","DOM","IK"]
[1,39,{"$f":"VLOOKUP(B24,STARTNA!$A$12:$H$96,2,)","v":"BOBANOVIĆ NIKO"},{"$f":"VLOOKUP(B24,STARTNA!$A$12:$H$96,3,)","v":"M"},{"$f":"VLOOKUP(B24,STARTNA!$A$12:$H$96,4,)","v":2012},{"$f":"VLOOKUP(B24,STARTNA!$A$12:$H$96,5,)","v":"M/Ž 15"},{"$f":"VLOOKUP(B24,STARTNA!$A$12:$H$96,6,)","v":"REKR"},{"$f":"VLOOKUP(B24,STARTNA!$A$12:$H$96,7,)","v":"SPLIT"},20.03,{"$f":"IF($H$12:$H$138=\"Omiš\",\"DOM\",)","v":0},{"$f":"AND(E24<2014,G24=\"KLUB\")","v":false}]
[2,33,{"$f":"VLOOKUP(B25,STARTNA!$A$12:$H$96,2,)","v":"BOŽAN LUKA"},{"$f":"VLOOKUP(B25,STARTNA!$A$12:$H$96,3,)","v":"M"},{"$f":"VLOOKUP(B25,STARTNA!$A$12:$H$96,4,)","v":2010},{"$f":"VLOOKUP(B25,STARTNA!$A$12:$H$96,5,)","v":"M/Ž 15"},{"$f":"VLOOKUP(B25,STARTNA!$A$12:$H$96,6,)","v":"REKR"},{"$f":"VLOOKUP(B25,STARTNA!$A$12:$H$96,7,)","v":"ZAGREB"},21,{"$f":"IF($H$12:$H$138=\"Omiš\",\"DOM\",)","v":0},{"$f":"AND(E25<2014,G25=\"KLUB\")","v":false}]
[]
[null,null,"Ž15"]
["rang","ST. BR","PREZIME I IME","S","GOD","KAT","klub/rekr","MJESTO","rez","DOM","IK"]
[1,31,{"$f":"VLOOKUP(B29,STARTNA!$A$12:$H$96,2,)","v":"GALIĆ PETRA"},"Ž",{"$f":"VLOOKUP(B29,STARTNA!$A$12:$H$96,4,)","v":2010},{"$f":"VLOOKUP(B29,STARTNA!$A$12:$H$96,5,)","v":"M/Ž 15"},{"$f":"VLOOKUP(B29,STARTNA!$A$12:$H$96,6,)","v":"REKR"},{"$f":"VLOOKUP(B29,STARTNA!$A$12:$H$96,7,)","v":"SPLIT"},20.16,{"$f":"IF($H$12:$H$138=\"Omiš\",\"DOM\",)","v":0},{"$f":"AND(E29<2014,G29=\"KLUB\")","v":false}]
[2,28,{"$f":"VLOOKUP(B30,STARTNA!$A$12:$H$96,2,)","v":"ZEKANOVIĆ MIA"},{"$f":"VLOOKUP(B30,STARTNA!$A$12:$H$96,3,)","v":"Ž"},{"$f":"VLOOKUP(B30,STARTNA!$A$12:$H$96,4,)","v":2010},{"$f":"VLOOKUP(B30,STARTNA!$A$12:$H$96,5,)","v":"M/Ž 15"},{"$f":"VLOOKUP(B30,STARTNA!$A$12:$H$96,6,)","v":"REKR"},{"$f":"VLOOKUP(B30,STARTNA!$A$12:$H$96,7,)","v":"ZADAR"},20.58,{"$f":"IF($H$12:$H$138=\"Omiš\",\"DOM\",)","v":0},{"$f":"AND(E30<2014,G30=\"KLUB\")","v":false}]
[3,37,{"$f":"VLOOKUP(B31,STARTNA!$A$12:$H$96,2,)","v":"JAKOVČIĆ ROZA"},{"$f":"VLOOKUP(B31,STARTNA!$A$12:$H$96,3,)","v":"Ž"},{"$f":"VLOOKUP(B31,STARTNA!$A$12:$H$96,4,)","v":2012},{"$f":"VLOOKUP(B31,STARTNA!$A$12:$H$96,5,)","v":"M/Ž 15"},{"$f":"VLOOKUP(B31,STARTNA!$A$12:$H$96,6,)","v":"REKR"},{"$f":"VLOOKUP(B31,STARTNA!$A$12:$H$96,7,)","v":"OMIŠ"},21.02,{"$f":"IF($H$12:$H$138=\"Omiš\",\"DOM\",)","v":"DOM"},{"$f":"AND(E31<2014,G31=\"KLUB\")","v":false}]
[]
[null,null,"M19"]
["rang","ST. BR","PREZIME I IME","S","GOD","KAT","klub/rekr","MJESTO","rez","DOM","IK"]
[1,32,{"$f":"VLOOKUP(B35,STARTNA!$A$12:$H$96,2,)","v":"TAFRA MATE"},{"$f":"VLOOKUP(B35,STARTNA!$A$12:$H$96,3,)","v":"M"},{"$f":"VLOOKUP(B35,STARTNA!$A$12:$H$96,4,)","v":2009},{"$f":"VLOOKUP(B35,STARTNA!$A$12:$H$96,5,)","v":"M/Ž 19"},{"$f":"VLOOKUP(B35,STARTNA!$A$12:$H$96,6,)","v":"REKR"},{"$f":"VLOOKUP(B35,STARTNA!$A$12:$H$96,7,)","v":"OMIŠ"},18.11,{"$f":"IF($H$12:$H$138=\"Omiš\",\"DOM\",)","v":"DOM"},0]
[2,46,{"$f":"VLOOKUP(B36,STARTNA!$A$12:$H$96,2,)","v":"MEKINIĆ PETAR"},{"$f":"VLOOKUP(B36,STARTNA!$A$12:$H$96,3,)","v":"M"},{"$f":"VLOOKUP(B36,STARTNA!$A$12:$H$96,4,)","v":2006},{"$f":"VLOOKUP(B36,STARTNA!$A$12:$H$96,5,)","v":"M/Ž 19"},{"$f":"VLOOKUP(B36,STARTNA!$A$12:$H$96,6,)","v":"REKR"},{"$f":"VLOOKUP(B36,STARTNA!$A$12:$H$96,7,)","v":"OMIŠ"},29.27,{"$f":"IF($H$12:$H$138=\"Omiš\",\"DOM\",)","v":"DOM"},{"$f":"AND(E36<2014,G36=\"KLUB\")","v":false}]
[]
[null,null,"Ž19"]
["rang","ST. BR","PREZIME I IME","S","GOD","KAT","klub/rekr","MJESTO","rez","DOM","IK"]
[1,30,{"$f":"VLOOKUP(B40,STARTNA!$A$12:$H$96,2,)","v":"BRZOVIĆ ANA"},{"$f":"VLOOKUP(B40,STARTNA!$A$12:$H$96,3,)","v":"Ž"},{"$f":"VLOOKUP(B40,STARTNA!$A$12:$H$96,4,)","v":2008},{"$f":"VLOOKUP(B40,STARTNA!$A$12:$H$96,5,)","v":"M/Ž 19"},{"$f":"VLOOKUP(B40,STARTNA!$A$12:$H$96,6,)","v":"REKR"},{"$f":"VLOOKUP(B40,STARTNA!$A$12:$H$96,7,)","v":"OMIŠ"},21.13,{"$f":"IF($H$12:$H$138=\"Omiš\",\"DOM\",)","v":"DOM"},{"$f":"AND(E40<2014,G40=\"KLUB\")","v":false}]
[]
[null,null,"M29"]
["rang","ST. BR","PREZIME I IME","S","GOD","KAT","klub/rekr","MJESTO","rez","DOM","IK"]
[1]
[]
[null,null,"Ž29"]
["rang","ST. BR","PREZIME I IME","S","GOD","KAT","klub/rekr","MJESTO","rez","DOM","IK"]
[1,null,null,null,null,null,null,null,null,{"$f":"IF($H$12:$H$128=\"Omiš\",\"DOM\",)","v":0},{"$f":"AND(E48<2011,G48=\"KLUB\")","v":false}]
[]
[null,null,"M39"]
["rang","ST. BR","PREZIME I IME","S","GOD","KAT","klub/rekr","MJESTO","rez","DOM","IK"]
[1,34,{"$f":"VLOOKUP(B52,STARTNA!$A$12:$H$96,2,)","v":"LATINOVIĆ SRĐAN"},{"$f":"VLOOKUP(B52,STARTNA!$A$12:$H$96,3,)","v":"M"},{"$f":"VLOOKUP(B52,STARTNA!$A$12:$H$96,4,)","v":1988},{"$f":"VLOOKUP(B52,STARTNA!$A$12:$H$96,5,)","v":"M/Ž 39"},{"$f":"VLOOKUP(B52,STARTNA!$A$12:$H$96,6,)","v":"REKR"},{"$f":"VLOOKUP(B52,STARTNA!$A$12:$H$96,7,)","v":"SPLIT"},19.11,{"$f":"IF($H$12:$H$138=\"Omiš\",\"DOM\",)","v":0},{"$f":"AND(E52<2014,G52=\"KLUB\")","v":false}]
[2,47,{"$f":"VLOOKUP(B53,STARTNA!$A$12:$H$96,2,)","v":"ČAGALJ VICKO"},{"$f":"VLOOKUP(B53,STARTNA!$A$12:$H$96,3,)","v":"M"},{"$f":"VLOOKUP(B53,STARTNA!$A$12:$H$96,4,)","v":1993},{"$f":"VLOOKUP(B53,STARTNA!$A$12:$H$96,5,)","v":"M/Ž 39"},{"$f":"VLOOKUP(B53,STARTNA!$A$12:$H$96,6,)","v":"REKR"},{"$f":"VLOOKUP(B53,STARTNA!$A$12:$H$96,7,)","v":"ZAGREB"},27.2,{"$f":"IF($H$12:$H$138=\"Omiš\",\"DOM\",)","v":0},{"$f":"AND(E53<2014,G53=\"KLUB\")","v":false}]
[3,55,{"$f":"VLOOKUP(B54,STARTNA!$A$12:$H$96,2,)","v":"PIVČEVIĆ IVO"},{"$f":"VLOOKUP(B54,STARTNA!$A$12:$H$96,3,)","v":"M"},{"$f":"VLOOKUP(B54,STARTNA!$A$12:$H$96,4,)","v":1993},{"$f":"VLOOKUP(B54,STARTNA!$A$12:$H$96,5,)","v":"M/Ž 39"},{"$f":"VLOOKUP(B54,STARTNA!$A$12:$H$96,6,)","v":"REKR"},{"$f":"VLOOKUP(B54,STARTNA!$A$12:$H$96,7,)","v":"OMIŠ"},27.34,{"$f":"IF($H$12:$H$138=\"Omiš\",\"DOM\",)","v":"DOM"},{"$f":"AND(E54<2014,G54=\"KLUB\")","v":false}]
[]
[null,null,"Ž39"]
["rang","ST. BR","PREZIME I IME","S","GOD","KAT","klub/rekr","MJESTO","rez","DOM","IK"]
[1,26,{"$f":"VLOOKUP(B58,STARTNA!$A$12:$H$96,2,)","v":"GRUBIŠIĆ INES"},{"$f":"VLOOKUP(B58,STARTNA!$A$12:$H$96,3,)","v":"Ž"},{"$f":"VLOOKUP(B58,STARTNA!$A$12:$H$96,4,)","v":1995},{"$f":"VLOOKUP(B58,STARTNA!$A$12:$H$96,5,)","v":"M/Ž 39"},{"$f":"VLOOKUP(B58,STARTNA!$A$12:$H$96,6,)","v":"REKR"},{"$f":"VLOOKUP(B58,STARTNA!$A$12:$H$96,7,)","v":"ZAGREB"},29.41,{"$f":"IF($H$12:$H$138=\"Omiš\",\"DOM\",)","v":0},{"$f":"AND(E58<2014,G58=\"KLUB\")","v":false}]
[2,15,{"$f":"VLOOKUP(B59,STARTNA!$A$12:$H$96,2,)","v":"LIPNJAK TAMARA"},{"$f":"VLOOKUP(B59,STARTNA!$A$12:$H$96,3,)","v":"Ž"},{"$f":"VLOOKUP(B59,STARTNA!$A$12:$H$96,4,)","v":1992},{"$f":"VLOOKUP(B59,STARTNA!$A$12:$H$96,5,)","v":"M/Ž 39"},{"$f":"VLOOKUP(B59,STARTNA!$A$12:$H$96,6,)","v":"REKR"},{"$f":"VLOOKUP(B59,STARTNA!$A$12:$H$96,7,)","v":"ZAGREB"},31.19,{"$f":"IF($H$12:$H$138=\"Omiš\",\"DOM\",)","v":0},{"$f":"AND(E59<2014,G59=\"KLUB\")","v":false}]
[]
[]
[null,null,"M49"]
["rang","ST. BR","PREZIME I IME","S","GOD","KAT","klub/rekr","MJESTO","rez","DOM","IK"]
[1,29,{"$f":"VLOOKUP(B64,STARTNA!$A$12:$H$96,2,)","v":"STOJANOVIĆ MIHOVIL"},{"$f":"VLOOKUP(B64,STARTNA!$A$12:$H$96,3,)","v":"M"},{"$f":"VLOOKUP(B64,STARTNA!$A$12:$H$96,4,)","v":1985},{"$f":"VLOOKUP(B64,STARTNA!$A$12:$H$96,5,)","v":"M/Ž 49"},{"$f":"VLOOKUP(B64,STARTNA!$A$12:$H$96,6,)","v":"REKR"},{"$f":"VLOOKUP(B64,STARTNA!$A$12:$H$96,7,)","v":"DRNIŠ"},19.16,{"$f":"IF($H$12:$H$138=\"Omiš\",\"DOM\",)","v":0},{"$f":"AND(E64<2014,G64=\"KLUB\")","v":false}]
[2,23,{"$f":"VLOOKUP(B65,STARTNA!$A$12:$H$96,2,)","v":"KUNDID IGOR"},{"$f":"VLOOKUP(B65,STARTNA!$A$12:$H$96,3,)","v":"M"},{"$f":"VLOOKUP(B65,STARTNA!$A$12:$H$96,4,)","v":1981},{"$f":"VLOOKUP(B65,STARTNA!$A$12:$H$96,5,)","v":"M/Ž 49"},{"$f":"VLOOKUP(B65,STARTNA!$A$12:$H$96,6,)","v":"REKR"},{"$f":"VLOOKUP(B65,STARTNA!$A$12:$H$96,7,)","v":"STOBREČ"},20.34,{"$f":"IF($H$12:$H$138=\"Omiš\",\"DOM\",)","v":0},{"$f":"AND(E65<2014,G65=\"KLUB\")","v":false}]
[3,54,{"$f":"VLOOKUP(B66,STARTNA!$A$12:$H$96,2,)","v":"BEBIĆ MIJO"},{"$f":"VLOOKUP(B66,STARTNA!$A$12:$H$96,3,)","v":"M"},{"$f":"VLOOKUP(B66,STARTNA!$A$12:$H$96,4,)","v":1978},{"$f":"VLOOKUP(B66,STARTNA!$A$12:$H$96,5,)","v":"M/Ž 49"},{"$f":"VLOOKUP(B66,STARTNA!$A$12:$H$96,6,)","v":"REKR"},{"$f":"VLOOKUP(B66,STARTNA!$A$12:$H$96,7,)","v":"SPLIT"},21.17,{"$f":"IF($H$12:$H$138=\"Omiš\",\"DOM\",)","v":0},{"$f":"AND(E66<2014,G66=\"KLUB\")","v":false}]
[]
[null,null,"Ž49"]
["rang","ST. BR","PREZIME I IME","S","GOD","KAT","klub/rekr","MJESTO","rez","DOM","IK"]
[1,21,{"$f":"VLOOKUP(B70,STARTNA!$A$12:$H$96,2,)","v":"ARAPOVIĆ ANA"},{"$f":"VLOOKUP(B70,STARTNA!$A$12:$H$96,3,)","v":"Ž"},{"$f":"VLOOKUP(B70,STARTNA!$A$12:$H$96,4,)","v":1982},{"$f":"VLOOKUP(B70,STARTNA!$A$12:$H$96,5,)","v":"M/Ž 49"},{"$f":"VLOOKUP(B70,STARTNA!$A$12:$H$96,6,)","v":"REKR"},{"$f":"VLOOKUP(B70,STARTNA!$A$12:$H$96,7,)","v":"SPLIT"},26.3,{"$f":"IF($H$12:$H$138=\"Omiš\",\"DOM\",)","v":0},{"$f":"AND(E70<2014,G70=\"KLUB\")","v":false}]
[2,6,{"$f":"VLOOKUP(B71,STARTNA!$A$12:$H$96,2,)","v":"KAČIĆ DUPLANČIĆ DIANA"},{"$f":"VLOOKUP(B71,STARTNA!$A$12:$H$96,3,)","v":"Ž"},{"$f":"VLOOKUP(B71,STARTNA!$A$12:$H$96,4,)","v":1978},{"$f":"VLOOKUP(B71,STARTNA!$A$12:$H$96,5,)","v":"M/Ž 49"},{"$f":"VLOOKUP(B71,STARTNA!$A$12:$H$96,6,)","v":"REKR"},{"$f":"VLOOKUP(B71,STARTNA!$A$12:$H$96,7,)","v":"SPLIT"},31.33,{"$f":"IF($H$12:$H$138=\"Omiš\",\"DOM\",)","v":0},{"$f":"AND(E71<2014,G71=\"KLUB\")","v":false}]
[]
[null,null,"M59"]
["rang","ST. BR","PREZIME I IME","S","GOD","KAT","klub/rekr","MJESTO","rez","DOM","IK"]
[1,27,{"$f":"VLOOKUP(B75,STARTNA!$A$12:$H$96,2,)","v":"GRUBIŠIĆ DRAGAN"},{"$f":"VLOOKUP(B75,STARTNA!$A$12:$H$96,3,)","v":"M"},{"$f":"VLOOKUP(B75,STARTNA!$A$12:$H$96,4,)","v":1968},{"$f":"VLOOKUP(B75,STARTNA!$A$12:$H$96,5,)","v":"M/Ž 59"},{"$f":"VLOOKUP(B75,STARTNA!$A$12:$H$96,6,)","v":"REKR"},{"$f":"VLOOKUP(B75,STARTNA!$A$12:$H$96,7,)","v":"ŠIBENIK"},22.24,{"$f":"IF($H$12:$H$138=\"Omiš\",\"DOM\",)","v":0},{"$f":"AND(E75<2014,G75=\"KLUB\")","v":false}]
[2,19,{"$f":"VLOOKUP(B76,STARTNA!$A$12:$H$96,2,)","v":"GRGAT MARIJO"},{"$f":"VLOOKUP(B76,STARTNA!$A$12:$H$96,3,)","v":"M"},{"$f":"VLOOKUP(B76,STARTNA!$A$12:$H$96,4,)","v":1974},{"$f":"VLOOKUP(B76,STARTNA!$A$12:$H$96,5,)","v":"M/Ž 59"},{"$f":"VLOOKUP(B76,STARTNA!$A$12:$H$96,6,)","v":"REKR"},{"$f":"VLOOKUP(B76,STARTNA!$A$12:$H$96,7,)","v":"DUGI RAT"},25.37,{"$f":"IF($H$12:$H$138=\"Omiš\",\"DOM\",)","v":0},{"$f":"AND(E76<2014,G76=\"KLUB\")","v":false}]
[3,45,{"$f":"VLOOKUP(B77,STARTNA!$A$12:$H$96,2,)","v":"MANDUŠIĆ IGOR"},{"$f":"VLOOKUP(B77,STARTNA!$A$12:$H$96,3,)","v":"M"},{"$f":"VLOOKUP(B77,STARTNA!$A$12:$H$96,4,)","v":1974},{"$f":"VLOOKUP(B77,STARTNA!$A$12:$H$96,5,)","v":"M/Ž 59"},{"$f":"VLOOKUP(B77,STARTNA!$A$12:$H$96,6,)","v":"REKR"},{"$f":"VLOOKUP(B77,STARTNA!$A$12:$H$96,7,)","v":"TROGIR"},25.46,{"$f":"IF($H$12:$H$138=\"Omiš\",\"DOM\",)","v":0},{"$f":"AND(E77<2014,G77=\"KLUB\")","v":false}]
[]
[null,null,"Ž59"]
["rang","ST. BR","PREZIME I IME","S","GOD","KAT","klub/rekr","MJESTO","rez","DOM","IK"]
[1,36,{"$f":"VLOOKUP(B81,STARTNA!$A$12:$H$96,2,)","v":"JAKOVČIĆ FABJANA"},{"$f":"VLOOKUP(B81,STARTNA!$A$12:$H$96,3,)","v":"Ž"},{"$f":"VLOOKUP(B81,STARTNA!$A$12:$H$96,4,)","v":1975},{"$f":"VLOOKUP(B81,STARTNA!$A$12:$H$96,5,)","v":"M/Ž 59"},{"$f":"VLOOKUP(B81,STARTNA!$A$12:$H$96,6,)","v":"REKR"},{"$f":"VLOOKUP(B81,STARTNA!$A$12:$H$96,7,)","v":"OMIŠ"},32.25,{"$f":"IF($H$12:$H$138=\"Omiš\",\"DOM\",)","v":"DOM"},{"$f":"AND(E81<2014,G81=\"KLUB\")","v":false}]
[2,14,{"$f":"VLOOKUP(B82,STARTNA!$A$12:$H$96,2,)","v":"ŠUŠNJAR PJERA"},{"$f":"VLOOKUP(B82,STARTNA!$A$12:$H$96,3,)","v":"Ž"},{"$f":"VLOOKUP(B82,STARTNA!$A$12:$H$96,4,)","v":1967},{"$f":"VLOOKUP(B82,STARTNA!$A$12:$H$96,5,)","v":"M/Ž 59"},{"$f":"VLOOKUP(B82,STARTNA!$A$12:$H$96,6,)","v":"REKR"},{"$f":"VLOOKUP(B82,STARTNA!$A$12:$H$96,7,)","v":"SPLIT"},34.450000000000003,{"$f":"IF($H$12:$H$138=\"Omiš\",\"DOM\",)","v":0},{"$f":"AND(E82<2014,G82=\"KLUB\")","v":false}]
[3,41,{"$f":"VLOOKUP(B83,STARTNA!$A$12:$H$96,2,)","v":"PERICA ŠINKA"},{"$f":"VLOOKUP(B83,STARTNA!$A$12:$H$96,3,)","v":"Ž"},{"$f":"VLOOKUP(B83,STARTNA!$A$12:$H$96,4,)","v":1966},{"$f":"VLOOKUP(B83,STARTNA!$A$12:$H$96,5,)","v":"M/Ž 59"},{"$f":"VLOOKUP(B83,STARTNA!$A$12:$H$96,6,)","v":"REKR"},{"$f":"VLOOKUP(B83,STARTNA!$A$12:$H$96,7,)","v":"OMIŠ"},39.44,{"$f":"IF($H$12:$H$138=\"Omiš\",\"DOM\",)","v":"DOM"},{"$f":"AND(E83<2014,G83=\"KLUB\")","v":false}]
[]
[]
[null,null,"M65"]
["rang","ST. BR","PREZIME I IME","S","GOD","KAT","klub/rekr","MJESTO","rez","DOM","IK"]
[1,12,{"$f":"VLOOKUP(B88,STARTNA!$A$12:$H$96,2,)","v":"DUMANIĆ NAĐAN"},{"$f":"VLOOKUP(B88,STARTNA!$A$12:$H$96,3,)","v":"M"},{"$f":"VLOOKUP(B88,STARTNA!$A$12:$H$96,4,)","v":1962},{"$f":"VLOOKUP(B88,STARTNA!$A$12:$H$96,5,)","v":"M/Ž 65"},{"$f":"VLOOKUP(B88,STARTNA!$A$12:$H$96,6,)","v":"REKR"},{"$f":"VLOOKUP(B88,STARTNA!$A$12:$H$96,7,)","v":"SPLIT"},34.11,{"$f":"IF($H$12:$H$138=\"Omiš\",\"DOM\",)","v":0},{"$f":"AND(E88<2014,G88=\"KLUB\")","v":false}]
[2,3,{"$f":"VLOOKUP(B89,STARTNA!$A$12:$H$96,2,)","v":"ŠKORIĆ JOSIP"},{"$f":"VLOOKUP(B89,STARTNA!$A$12:$H$96,3,)","v":"M"},{"$f":"VLOOKUP(B89,STARTNA!$A$12:$H$96,4,)","v":1960},{"$f":"VLOOKUP(B89,STARTNA!$A$12:$H$96,5,)","v":"M/Ž 65"},{"$f":"VLOOKUP(B89,STARTNA!$A$12:$H$96,6,)","v":"REKR"},{"$f":"VLOOKUP(B89,STARTNA!$A$12:$H$96,7,)","v":"BIH"},35.04,{"$f":"IF($H$12:$H$138=\"Omiš\",\"DOM\",)","v":0},{"$f":"AND(E89<2014,G89=\"KLUB\")","v":false}]
[3,13,{"$f":"VLOOKUP(B90,STARTNA!$A$12:$H$96,2,)","v":"ŠUŠNJAR MARIN"},{"$f":"VLOOKUP(B90,STARTNA!$A$12:$H$96,3,)","v":"M"},{"$f":"VLOOKUP(B90,STARTNA!$A$12:$H$96,4,)","v":1961},{"$f":"VLOOKUP(B90,STARTNA!$A$12:$H$96,5,)","v":"M/Ž 65"},{"$f":"VLOOKUP(B90,STARTNA!$A$12:$H$96,6,)","v":"REKR"},{"$f":"VLOOKUP(B90,STARTNA!$A$12:$H$96,7,)","v":"SPLIT"},37.29,{"$f":"IF($H$12:$H$138=\"Omiš\",\"DOM\",)","v":0},{"$f":"AND(E90<2014,G90=\"KLUB\")","v":false}]
[]
[null,null,"Ž65"]
["rang"]
[1,8,{"$f":"VLOOKUP(B94,STARTNA!$A$12:$H$96,2,)","v":"VERINA MARIA "},{"$f":"VLOOKUP(B94,STARTNA!$A$12:$H$96,3,)","v":"Ž"},{"$f":"VLOOKUP(B94,STARTNA!$A$12:$H$96,4,)","v":1965},{"$f":"VLOOKUP(B94,STARTNA!$A$12:$H$96,5,)","v":"M/Ž 65"},{"$f":"VLOOKUP(B94,STARTNA!$A$12:$H$96,6,)","v":"REKR"},{"$f":"VLOOKUP(B94,STARTNA!$A$12:$H$96,7,)","v":"SUTIVAN"},32.020000000000003,{"$f":"IF($H$12:$H$138=\"Omiš\",\"DOM\",)","v":0},{"$f":"AND(E94<2014,G94=\"KLUB\")","v":false}]
[]
[null,null,"M70"]
["rang","ST. BR","PREZIME I IME","S","GOD","KAT","klub/rekr","MJESTO","rez","DOM","IK"]
[1,4,{"$f":"VLOOKUP(B98,STARTNA!$A$12:$H$96,2,)","v":"ĆOSIĆ HRVOJE"},{"$f":"VLOOKUP(B98,STARTNA!$A$12:$H$96,3,)","v":"M"},{"$f":"VLOOKUP(B98,STARTNA!$A$12:$H$96,4,)","v":1959},{"$f":"VLOOKUP(B98,STARTNA!$A$12:$H$96,5,)","v":"M/Ž 70"},{"$f":"VLOOKUP(B98,STARTNA!$A$12:$H$96,6,)","v":"REKR"},{"$f":"VLOOKUP(B98,STARTNA!$A$12:$H$96,7,)","v":"BIH"},34.07,{"$f":"IF($H$12:$H$138=\"Omiš\",\"DOM\",)","v":0},{"$f":"AND(E98<2014,G98=\"KLUB\")","v":false}]
[2,56,{"$f":"VLOOKUP(B99,STARTNA!$A$12:$H$96,2,)","v":"MIMICA MIROSLAV"},{"$f":"VLOOKUP(B99,STARTNA!$A$12:$H$96,3,)","v":"M"},{"$f":"VLOOKUP(B99,STARTNA!$A$12:$H$96,4,)","v":1958},{"$f":"VLOOKUP(B99,STARTNA!$A$12:$H$96,5,)","v":"M/Ž 70"},{"$f":"VLOOKUP(B99,STARTNA!$A$12:$H$96,6,)","v":"REKR"},{"$f":"VLOOKUP(B99,STARTNA!$A$12:$H$96,7,)","v":"DUGI RAT"},40.369999999999997,{"$f":"IF($H$12:$H$138=\"Omiš\",\"DOM\",)","v":0},{"$f":"AND(E99<2014,G99=\"KLUB\")","v":false}]
[]
[null,null,"Ž70"]
["rang"]
[1]
[]
[null,null,"M75"]
["rang","ST. BR","PREZIME I IME","S","GOD","KAT","klub/rekr","MJESTO","rez","DOM","IK"]
[1,1,{"$f":"VLOOKUP(B107,STARTNA!$A$12:$H$96,2,)","v":"PRVAN BORKO"},{"$f":"VLOOKUP(B107,STARTNA!$A$12:$H$96,3,)","v":"M"},{"$f":"VLOOKUP(B107,STARTNA!$A$12:$H$96,4,)","v":1951},{"$f":"VLOOKUP(B107,STARTNA!$A$12:$H$96,5,)","v":"M/Ž 75"},{"$f":"VLOOKUP(B107,STARTNA!$A$12:$H$96,6,)","v":"REKR"},{"$f":"VLOOKUP(B107,STARTNA!$A$12:$H$96,7,)","v":"ZAGREB"},21.51,{"$f":"IF($H$12:$H$138=\"Omiš\",\"DOM\",)","v":0},{"$f":"AND(E107<2014,G107=\"KLUB\")","v":false}]
[2,7,{"$f":"VLOOKUP(B108,STARTNA!$A$12:$H$96,2,)","v":"KEKEZ ANTE"},{"$f":"VLOOKUP(B108,STARTNA!$A$12:$H$96,3,)","v":"M"},{"$f":"VLOOKUP(B108,STARTNA!$A$12:$H$96,4,)","v":1950},{"$f":"VLOOKUP(B108,STARTNA!$A$12:$H$96,5,)","v":"M/Ž 75"},{"$f":"VLOOKUP(B108,STARTNA!$A$12:$H$96,6,)","v":"REKR"},{"$f":"VLOOKUP(B108,STARTNA!$A$12:$H$96,7,)","v":"OMIŠ"},27.48,{"$f":"IF($H$12:$H$138=\"Omiš\",\"DOM\",)","v":"DOM"},{"$f":"AND(E108<2014,G108=\"KLUB\")","v":false}]
[3,5,{"$f":"VLOOKUP(B109,STARTNA!$A$12:$H$96,2,)","v":"KAČIĆ ZORAN"},{"$f":"VLOOKUP(B109,STARTNA!$A$12:$H$96,3,)","v":"M"},{"$f":"VLOOKUP(B109,STARTNA!$A$12:$H$96,4,)","v":1950},{"$f":"VLOOKUP(B109,STARTNA!$A$12:$H$96,5,)","v":"M/Ž 75"},{"$f":"VLOOKUP(B109,STARTNA!$A$12:$H$96,6,)","v":"REKR"},{"$f":"VLOOKUP(B109,STARTNA!$A$12:$H$96,7,)","v":"SPLIT"},28.16,{"$f":"IF($H$12:$H$138=\"Omiš\",\"DOM\",)","v":0},{"$f":"AND(E109<2014,G109=\"KLUB\")","v":false}]
[]
[null,null,"Ž75"]
["rang"]
[1]
[]
[null,null,"M76 +"]
["rang","ST. BR","PREZIME I IME","S","GOD","KAT","klub/rekr","MJESTO","rez","DOM","IK"]
[1]
[]
[null,null,"Ž76 +"]
["rang"]
[1]
[]
[]
[" "]